{"text_format":"1","workbook":"xlsx","n_sheets":3,"sheets":["ОСНОВНОЙ ТАБЕЛЬ","ТАБЛИЦА","норма"],"not_rendered":{"charts":0,"images":0,"macros":1,"external_links":0,"defined_names":6,"comments":0,"pivot_tables":0},"unopened":[],"bounds":{"document_bytes":16777216,"sheet_cells":100000,"rows_first":2000,"rows_last":500,"rows_between":2000,"halvings":0,"cell_chars":16384,"cell_head_chars":4096},"cells_cut":0,"cells_raw":0,"read":"whole","date_system":"1900"}

{"sheet":"ОСНОВНОЙ ТАБЕЛЬ","index":0,"n_rows":37,"n_cols":44,"rows_kept":37,"cut":false,"hidden":false,"merged":[[32,32,32,35],[33,32,33,35],[34,32,34,35],[35,32,35,35],[36,32,36,35],[5,2,9,2],[8,28,9,28],[8,30,9,30],[8,31,9,31],[8,36,9,36],[8,29,9,29],[5,6,9,6],[8,12,9,12],[8,13,9,13],[8,14,9,14],[8,15,9,15],[8,16,9,16],[8,7,9,7],[0,0,1,1],[0,4,1,4],[3,2,3,39],[4,22,4,23],[8,32,9,32],[8,21,9,21],[5,5,9,5],[8,17,9,17],[8,35,9,35],[8,33,9,33],[8,34,9,34],[8,18,9,18],[8,19,9,19],[5,4,9,4],[8,37,9,37],[5,3,9,3],[2,2,2,39],[0,2,1,3],[0,12,0,18],[4,15,4,18],[0,19,0,29],[1,12,1,18],[5,41,9,41],[5,39,9,39],[5,7,5,37],[5,40,9,40],[5,38,9,38],[8,22,9,22],[8,23,9,23],[8,24,9,24],[8,25,9,25],[8,26,9,26],[8,27,9,27],[8,11,9,11],[8,20,9,20],[8,8,9,8],[8,9,9,9],[8,10,9,10]]}
["ОТЧЁТНЫЙ ПЕРИОД",null,{"$f":"--(1&\"/\"&E1&\"/\"&норма!$A$1)","v":"2015-02-01"},null,2,null,null,null,null,null,null,null,"Предпраздничный",null,null,null,null,null,null,"Праздничные"]
[null,null,null,null,null,null,null,null,null,null,null,null,{"$f":"IFERROR(--(INDEX(норма!$M$3:$M$14,$E1)&\"/\"&$E1),\"\")","v":""},null,null,null,null,null,null,{"$f":"IFERROR(--(INDEX(норма!D3:D14,$E1)&\"/\"&$E1),\"\")","v":"2015-02-23"},{"$f":"IFERROR(--(INDEX(норма!E3:E14,$E1)&\"/\"&$E1),\"\")","v":""},{"$f":"IFERROR(--(INDEX(норма!F3:F14,$E1)&\"/\"&$E1),\"\")","v":""},{"$f":"IFERROR(--(INDEX(норма!G3:G14,$E1)&\"/\"&$E1),\"\")","v":""},{"$f":"IFERROR(--(INDEX(норма!H3:H14,$E1)&\"/\"&$E1),\"\")","v":""},{"$f":"IFERROR(--(INDEX(норма!I3:I14,$E1)&\"/\"&$E1),\"\")","v":""},{"$f":"IFERROR(--(INDEX(норма!J3:J14,$E1)&\"/\"&$E1),\"\")","v":""},{"$f":"IFERROR(--(INDEX(норма!K3:K14,$E1)&\"/\"&$E1),\"\")","v":""},{"$f":"IFERROR(--(INDEX(норма!L3:L14,$E1)&\"/\"&$E1),\"\")","v":""}]
[null,null,"Т А Б Е Л Ь"]
[null,null," рабочего времени участка такелажных работ 1 категории"]
[null,null,null,null,null,null,null,null,null,null,null,null,null,null,"за",{"$f":"C1","v":"2015-02-01"},null,null,null,"месяц",null,null,2015,null,"г."]
[null,null,"№ по сп","Фамилия,И,О.","Таб. №","Разряд","Специальность","ДНИ МЕСЯЦА",null,null,null,null,null,null,null,null,null,null,null,null,null,null,null,null,null,null,null,null,null,null,null,null,null,null,null,null,null,null,"Итого дней за месяц","Итого часов за месяц","Кол-во вых.дней","Кол-во вых.часов"]
[]
[null,null,null,null,null,null,null,{"$f":"H9","v":"2015-02-01"},"2015-02-02","2015-02-03","2015-02-04","2015-02-05","2015-02-06","2015-02-07","2015-02-08","2015-02-09","2015-02-10","2015-02-11","2015-02-12","2015-02-13","2015-02-14","2015-02-15","2015-02-16","2015-02-17","2015-02-18","2015-02-19","2015-02-20","2015-02-21","2015-02-22","2015-02-23","2015-02-24","2015-02-25","2015-02-26","2015-02-27","2015-02-28","","",""]
[null,null,null,null,null,null,null,{"$f":"C1","v":"2015-02-01"},{"$f":"H9+1","v":"2015-02-02"},"2015-02-03","2015-02-04","2015-02-05","2015-02-06","2015-02-07","2015-02-08","2015-02-09","2015-02-10","2015-02-11","2015-02-12","2015-02-13","2015-02-14","2015-02-15","2015-02-16","2015-02-17","2015-02-18","2015-02-19","2015-02-20","2015-02-21","2015-02-22","2015-02-23","2015-02-24","2015-02-25","2015-02-26","2015-02-27","2015-02-28",{"$f":"IF(DAY($AI9+1)>DAY(AI9),$AI9+1,\"\")","v":""},{"$f":"IF(DAY($AI9+2)>DAY(AI9),$AI9+2,\"\")","v":""},{"$f":"IF(DAY($AI9+3)>DAY(AI9),$AI9+3,\"\")","v":""}]
[null,null,null,null,null,null,null,null,null,null,null,null,null,null,null,null,null,null,null,null,null,null,null,null,null,null,null,null,null,null,null,null,null,null,null,null,null,null,null,null,null,null,null,"д/о за месяц"]
[]
[null,null,1,"Иванова А.В.",null,null,null,null,null,null,null,null,null,null,null,null,null,null,8,7,7,7,7,null,null,null,null,null,null,null,null,null,null,null,null,null,null,null,{"$f":"COUNT(H12:AL12)+SUMPRODUCT((ТАБЛИЦА!$F$1:$F$28=H12:AL12)*ТАБЛИЦА!$G$1:$G$28)","v":5},{"$f":"SUMPRODUCT(--TEXT(SUBSTITUTE(SUBSTITUTE(H12:AL12,\"я\",\"\"),\"/\",\"\"),\"#,#;;0;\\0\"))+SUM(H13:AL13)","v":36},{"$f":"SUM(((IFERROR(WEEKDAY(H$9:AL$9,2),)>5)+(ISNUMBER(MATCH(--H$9:AL$9,T$2:AD$2,))))*ISNUMBER(H12:AL12))","v":2},{"$f":"SUM(((IFERROR(WEEKDAY(H$9:AL$9,2),)>5)+(ISNUMBER(MATCH(--H$9:AL$9,T$2:AD$2,))))*IF(ISNUMBER(H12:AL12),H12:AL12,))","v":14}]
[]
[]
[null,null,2,"Сергеева",null,null,null,null,null,null,null,null,null,null,null,null,null,null,8,7,7,7,7,null,null,null,null,null,null,null,null,null,null,null,null,null,null,null,{"$f":"COUNT(H15:AL15)+SUMPRODUCT((ТАБЛИЦА!$F$1:$F$28=H15:AL15)*ТАБЛИЦА!$G$1:$G$28)","v":5},{"$f":"SUMPRODUCT(--TEXT(SUBSTITUTE(SUBSTITUTE(H15:AL15,\"я\",\"\"),\"/\",\"\"),\"#,#;;0;\\0\"))+SUM(H16:AL16)","v":36},{"$f":"SUM(((IFERROR(WEEKDAY(H$9:AL$9,2),)>5)+(ISNUMBER(MATCH(--H$9:AL$9,T$2:AD$2,))))*ISNUMBER(H15:AL15))","v":2},{"$f":"SUM(((IFERROR(WEEKDAY(H$9:AL$9,2),)>5)+(ISNUMBER(MATCH(--H$9:AL$9,T$2:AD$2,))))*IF(ISNUMBER(H15:AL15),H15:AL15,))","v":14},null,{"$f":"IF(COUNTIF('ОСНОВНОЙ ТАБЕЛЬ'!H15:AL15,\"д/о\"),COUNTIF('ОСНОВНОЙ ТАБЕЛЬ'!H15:AL15,\"д/о\"),\"\")","v":""}]
[]
[]
[null,null,3,"Петров",null,null,null,null,null,8,8,8,8,null,8,8,8,null,8,8,8,8,8,8,null,"Д/О",null,null,null,null,null,null,null,null,null,null,null,null,{"$f":"COUNT(H18:AL18)+SUMPRODUCT((ТАБЛИЦА!$B$1:$B$28=H18:AL18)*ТАБЛИЦА!$C$1:$C$28)","v":13},{"$f":"SUMPRODUCT(--TEXT(SUBSTITUTE(SUBSTITUTE(H18:AL18,\"я\",\"\"),\"/\",\"\"),\"#,#;;0;\\0\"))+SUM(H19:AL19)","v":104},{"$f":"SUM(((IFERROR(WEEKDAY(H$9:AL$9,2),)>5)+(ISNUMBER(MATCH(--H$9:AL$9,T$2:AD$2,))))*ISNUMBER(H18:AL18))","v":3},{"$f":"SUM(((IFERROR(WEEKDAY(H$9:AL$9,2),)>5)+(ISNUMBER(MATCH(--H$9:AL$9,T$2:AD$2,))))*IF(ISNUMBER(H18:AL18),H18:AL18,))","v":24},null,{"$f":"IF(COUNTIF('ОСНОВНОЙ ТАБЕЛЬ'!H18:AL18,\"д/о\"),COUNTIF('ОСНОВНОЙ ТАБЕЛЬ'!H18:AL18,\"д/о\"),\"\")","v":1}]
[]
[]
[null,null,4,"Шевчук",null,null,null,null,null,8,8,8,8,null,8,8,8,null,8,8,"Д/О",8,"Д/О",null,8,null,null,null,null,null,null,null,null,null,null,null,null,null,{"$f":"COUNT(H21:AL21)+SUMPRODUCT((ТАБЛИЦА!$B$1:$B$28=H21:AL21)*ТАБЛИЦА!$C$1:$C$28)","v":11},{"$f":"SUMPRODUCT(--TEXT(SUBSTITUTE(SUBSTITUTE(H21:AL21,\"я\",\"\"),\"/\",\"\"),\"#,#;;0;\\0\"))+SUM(H22:AL22)","v":88},{"$f":"SUM(((IFERROR(WEEKDAY(H$9:AL$9,2),)>5)+(ISNUMBER(MATCH(--H$9:AL$9,T$2:AD$2,))))*ISNUMBER(H21:AL21))","v":2},{"$f":"SUM(((IFERROR(WEEKDAY(H$9:AL$9,2),)>5)+(ISNUMBER(MATCH(--H$9:AL$9,T$2:AD$2,))))*IF(ISNUMBER(H21:AL21),H21:AL21,))","v":16},null,{"$f":"IF(COUNTIF('ОСНОВНОЙ ТАБЕЛЬ'!H21:AL21,\"д/о\"),COUNTIF('ОСНОВНОЙ ТАБЕЛЬ'!H21:AL21,\"д/о\"),\"\")","v":2}]
[]
[]
[null,null,5,"Сидорова А.А.",null,null,null,null,null,8,8,8,8,null,8,8,8,null,"я/7","Д/О",8,"5/я","Д/О",8,null,null,null,null,null,null,null,null,null,null,null,null,null,null,{"$f":"COUNT(H24:AL24)+SUMPRODUCT((ТАБЛИЦА!$F$1:$F$28=H24:AL24)*ТАБЛИЦА!$G$1:$G$28)","v":9.7100000000000009},{"$f":"SUMPRODUCT(--TEXT(SUBSTITUTE(SUBSTITUTE(H24:AL24,\"я\",\"\"),\"/\",\"\"),\"#,#;;0;\\0\"))+SUM(H25:AL25)","v":84},{"$f":"SUM(((IFERROR(WEEKDAY(H$9:AL$9,2),)>5)+(ISNUMBER(MATCH(--H$9:AL$9,T$2:AD$2,))))*ISNUMBER(H24:AL24))","v":2},{"$f":"SUM(((IFERROR(WEEKDAY(H$9:AL$9,2),)>5)+(ISNUMBER(MATCH(--H$9:AL$9,T$2:AD$2,))))*IF(ISNUMBER(H24:AL24),H24:AL24,))","v":16},null,{"$f":"IF(COUNTIF('ОСНОВНОЙ ТАБЕЛЬ'!H24:AL24,\"д/о\"),COUNTIF('ОСНОВНОЙ ТАБЕЛЬ'!H24:AL24,\"д/о\"),\"\")","v":2}]
[]
[]
[null,null,6,"Кравчук",null,null,null,null,null,8,8,8,8,null,8,8,8,null,8,8,8,8,8,8,null,null,null,null,null,null,null,null,null,null,null,null,null,null,{"$f":"COUNT(H27:AL27)+SUMPRODUCT((ТАБЛИЦА!$B$1:$B$28=H27:AL27)*ТАБЛИЦА!$C$1:$C$28)","v":13},{"$f":"SUMPRODUCT(--TEXT(SUBSTITUTE(SUBSTITUTE(H27:AL27,\"я\",\"\"),\"/\",\"\"),\"#,#;;0;\\0\"))+SUM(H28:AL28)","v":112},{"$f":"SUM(((IFERROR(WEEKDAY(H$9:AL$9,2),)>5)+(ISNUMBER(MATCH(--H$9:AL$9,T$2:AD$2,))))*ISNUMBER(H27:AL27))","v":3},{"$f":"SUM(((IFERROR(WEEKDAY(H$9:AL$9,2),)>5)+(ISNUMBER(MATCH(--H$9:AL$9,T$2:AD$2,))))*IF(ISNUMBER(H27:AL27),H27:AL27,))","v":24},null,{"$f":"IF(COUNTIF('ОСНОВНОЙ ТАБЕЛЬ'!H27:AL27,\"д/о\"),COUNTIF('ОСНОВНОЙ ТАБЕЛЬ'!H27:AL27,\"д/о\"),\"\")","v":""}]
[null,null,null,null,null,null,null,null,null,null,null,null,null,null,null,null,null,null,4,null,4]
[]
[null,null,7,"Коновалов А.Г.",null,null,null,null,null,null,8,8,null,null,null,8,null,null,8,8,8,8,8,null,null,null,null,null,null,null,null,null,null,null,null,null,null,null,{"$f":"COUNT(H30:AL30)+SUMPRODUCT((ТАБЛИЦА!$B$1:$B$28=H30:AL30)*ТАБЛИЦА!$C$1:$C$28)","v":8},{"$f":"SUMPRODUCT(--TEXT(SUBSTITUTE(SUBSTITUTE(H30:AL30,\"я\",\"\"),\"/\",\"\"),\"#,#;;0;\\0\"))+SUM(H31:AL31)","v":64},{"$f":"SUM(((IFERROR(WEEKDAY(H$9:AL$9,2),)>5)+(ISNUMBER(MATCH(--H$9:AL$9,T$2:AD$2,))))*ISNUMBER(H30:AL30))","v":2},{"$f":"SUM(((IFERROR(WEEKDAY(H$9:AL$9,2),)>5)+(ISNUMBER(MATCH(--H$9:AL$9,T$2:AD$2,))))*IF(ISNUMBER(H30:AL30),H30:AL30,))","v":16},null,{"$f":"IF(COUNTIF('ОСНОВНОЙ ТАБЕЛЬ'!H30:AL30,\"д/о\"),COUNTIF('ОСНОВНОЙ ТАБЕЛЬ'!H30:AL30,\"д/о\"),\"\")","v":""}]
[]
[]
[null,null,"Необходимо при смене месяца (начальная и конечная дата рабочего дня),даже при смене месяца в ячейке Е1например",null,null,null,null,null,null,null,null,null,null,null,null,null,null,null,null,null,null,null,null,null,null,null,null,null,null,null,null,null,"январь",null,null,null,12,30,"сюда",null,{"$f":"DAY(WORKDAY(C1-1,1,Пр))","v":2},{"$f":"DAY(WORKDAY(EOMONTH(C1,0)+1,-1,Пр))","v":27}]
[null,null,null,null,null,null,null,null,null,null,null,null,null,null,null,null,null,null,null,null,null,null,null,null,null,null,null,null,null,null,null,null,"февраль",null,null,null,2,27]
[null,null,null,null,null,null,null,null,null,null,null,null,null,null,null,null,null,null,null,null,null,null,null,null,null,null,null,null,null,null,null,null,"март",null,null,null,2,31]
[null,null,null,null,null,null,null,null,null,null,null,null,null,null,null,null,null,null,null,null,null,null,null,null,null,null,null,null,null,null,null,null,"апрель",null,null,null,1,30]
[null,null,null,null,null,null,null,null,null,null,null,null,null,null,null,null,null,null,null,null,null,null,null,null,null,null,null,null,null,null,null,null,"май",null,null,null,5,29]

{"sheet":"ТАБЛИЦА","index":1,"n_rows":62,"n_cols":7,"rows_kept":62,"cut":false,"hidden":false,"merged":[[0,0,27,0],[0,4,27,4]]}
["8 часовой рабочий день","7,5/я",0.94,null,"7 часовой рабочий день"]
[null,"7/я",0.87]
[null,"6,5/я",0.81,null,null,"6,5/я",0.93]
[null,"6/я",0.75,null,null,"6/я",0.86]
[null,"5,5/я",0.68,null,null,"5,5/я",0.78]
[null,"5/я",0.62,null,null,"5/я",0.71]
[null,"4,5/я",0.56000000000000005,null,null,"4,5/я",0.64]
[null,"4/я",0.5,null,null,"4/я",0.56999999999999995]
[null,"3,5/я",0.43,null,null,"3,5/я",0.5]
[null,"3/я",0.37,null,null,"3/я",0.43]
[null,"2,5/я",0.31,null,null,"2,5/я",0.36]
[null,"2/я",0.25,null,null,"2/я",0.28000000000000003]
[null,"1,5/я",0.18,null,null,"1,5/я",0.21]
[null,"1/я",0.12,null,null,"1/я",0.14000000000000001]
[null,"я/1",0.12,null,null,"я/1",0.14000000000000001]
[null,"я/1,5",0.18,null,null,"я/1,5",0.21]
[null,"я/2",0.25,null,null,"я/2",0.28000000000000003]
[null,"я/2,5",0.31,null,null,"я/2,5",0.36]
[null,"я/3",0.37,null,null,"я/3",0.43]
[null,"я/3,5",0.43,null,null,"я/3,5",0.5]
[null,"я/4",0.5,null,null,"я/4",0.56999999999999995]
[null,"я/4,5",0.56000000000000005,null,null,"я/4,5",0.64]
[null,"я/5",0.62,null,null,"я/5",0.71]
[null,"я/5,5",0.68,null,null,"я/5,5",0.78]
[null,"я/6",0.75,null,null,"я/6",0.86]
[null,"я/6,5",0.81,null,null,"я/6,5",0.93]
[null,"я/7",0.87]
[null,"я/7,5",0.94]
[]
[]
[]
[]
[]
[]
[]
[]
[]
[]
[]
[]
[]
[]
[]
[]
[]
[]
[]
[]
[]
[]
[]
[]
[]
[]
[]
[]
[]
[]
[]
[]
[]
[7,7,8,8,7,{"$f":"COUNT(A62:E62)+SUMPRODUCT(($B$1:$B$28=A62:E62)*$C$1:$C$28)","v":5},{"$f":"SUMPRODUCT(--SUBSTITUTE(SUBSTITUTE(A62:E62,\"я\",\"\"),\"/\",\"*\"))","v":37}]

{"sheet":"норма","index":2,"n_rows":30,"n_cols":22,"rows_kept":30,"cut":false,"hidden":false,"merged":[[11,1,13,1],[0,1,0,11],[1,3,1,11],[2,1,4,1],[5,1,7,1],[8,1,10,1],[24,1,26,1],[27,1,29,1],[16,1,16,6],[17,3,17,4],[17,5,17,6],[18,1,20,1],[21,1,23,1]]}
[2015,"Заполняется раз в год",null,null,null,null,null,null,null,null,null,null,null,null,null,null,null,null,null,null,null,"Праздники"]
[null,null,null,"Праздничные",null,null,null,null,null,null,null,null,"Предпраздничные","тут нужно заполнять ТОЛЬКО праздники, которые НЕ в выходные дни",null,null,null,null,null,null,null,{"$f":"IFERROR(SMALL(IF(D$3:L$14,--(D$3:L$14&\"/\"&C$3:C$14&\"/\"&A$1)),ROW(V1)),\"\")","v":"2015-01-01"}]
[null,"1 квартал","январь",1,2,5,6,7,8,9,null,null,null,"Если случайна заполнили иначе, то выдельтся красным",null,null,null,null,null,null,null,{"$f":"IFERROR(SMALL(IF(D$3:L$14,--(D$3:L$14&\"/\"&C$3:C$14&\"/\"&A$1)),ROW(V2)),\"\")","v":"2015-01-02"}]
[null,null,"февраль",23,null,null,null,null,null,null,null,null,null,null,null,null,null,null,null,null,null,{"$f":"IFERROR(SMALL(IF(D$3:L$14,--(D$3:L$14&\"/\"&C$3:C$14&\"/\"&A$1)),ROW(V3)),\"\")","v":"2015-01-05"}]
[null,null,"март",9,null,null,null,null,null,null,null,null,null,null,null,null,null,null,null,null,null,{"$f":"IFERROR(SMALL(IF(D$3:L$14,--(D$3:L$14&\"/\"&C$3:C$14&\"/\"&A$1)),ROW(V4)),\"\")","v":"2015-01-06"}]
[null,"2 квартал","апрель",null,null,null,null,null,null,null,null,null,30,null,null,null,null,null,null,null,null,{"$f":"IFERROR(SMALL(IF(D$3:L$14,--(D$3:L$14&\"/\"&C$3:C$14&\"/\"&A$1)),ROW(V5)),\"\")","v":"2015-01-07"}]
[null,null,"май",1,4,11,null,null,null,null,null,null,8,null,null,null,null,null,null,null,null,{"$f":"IFERROR(SMALL(IF(D$3:L$14,--(D$3:L$14&\"/\"&C$3:C$14&\"/\"&A$1)),ROW(V6)),\"\")","v":"2015-01-08"}]
[null,null,"июнь",12,null,null,null,null,null,null,null,null,11,null,null,null,null,null,null,null,null,{"$f":"IFERROR(SMALL(IF(D$3:L$14,--(D$3:L$14&\"/\"&C$3:C$14&\"/\"&A$1)),ROW(V7)),\"\")","v":"2015-01-09"}]
[null,"3 квартал","июль",null,null,null,null,null,null,null,null,null,null,null,null,null,null,null,null,null,null,{"$f":"IFERROR(SMALL(IF(D$3:L$14,--(D$3:L$14&\"/\"&C$3:C$14&\"/\"&A$1)),ROW(V8)),\"\")","v":"2015-02-23"}]
[null,null,"август",null,null,null,null,null,null,null,null,null,null,null,null,null,null,null,null,null,null,{"$f":"IFERROR(SMALL(IF(D$3:L$14,--(D$3:L$14&\"/\"&C$3:C$14&\"/\"&A$1)),ROW(V9)),\"\")","v":"2015-03-09"}]
[null,null,"сентябрь",null,null,null,null,null,null,null,null,null,null,null,null,null,null,null,null,null,null,{"$f":"IFERROR(SMALL(IF(D$3:L$14,--(D$3:L$14&\"/\"&C$3:C$14&\"/\"&A$1)),ROW(V10)),\"\")","v":"2015-05-01"}]
[null,"4 квартал","октябрь",null,null,null,null,null,null,null,null,null,null,null,null,null,null,null,null,null,null,{"$f":"IFERROR(SMALL(IF(D$3:L$14,--(D$3:L$14&\"/\"&C$3:C$14&\"/\"&A$1)),ROW(V11)),\"\")","v":"2015-05-04"}]
[null,null,"ноябрь",4,null,null,null,null,null,null,null,null,3,null,null,null,null,null,null,null,null,{"$f":"IFERROR(SMALL(IF(D$3:L$14,--(D$3:L$14&\"/\"&C$3:C$14&\"/\"&A$1)),ROW(V12)),\"\")","v":"2015-05-11"}]
[null,null,"декабрь",null,null,null,null,null,null,null,null,null,31,null,null,null,null,null,null,null,null,{"$f":"IFERROR(SMALL(IF(D$3:L$14,--(D$3:L$14&\"/\"&C$3:C$14&\"/\"&A$1)),ROW(V13)),\"\")","v":"2015-06-12"}]
[null,null,null,null,null,null,null,null,null,null,null,null,null,null,null,null,null,null,null,null,null,{"$f":"IFERROR(SMALL(IF(D$3:L$14,--(D$3:L$14&\"/\"&C$3:C$14&\"/\"&A$1)),ROW(V14)),\"\")","v":"2015-11-04"}]
[null,null,null,null,null,null,null,null,null,null,null,null,null,null,null,null,null,null,null,null,null,{"$f":"IFERROR(SMALL(IF(D$3:L$14,--(D$3:L$14&\"/\"&C$3:C$14&\"/\"&A$1)),ROW(V15)),\"\")","v":""}]
[null,"Производственный календарь на 2014г. при 5 дневной рабочей неделе",null,null,null,null,null,null,null,null,null,null,null,null,null,null,null,null,null,null,null,{"$f":"IFERROR(SMALL(IF(D$3:L$14,--(D$3:L$14&\"/\"&C$3:C$14&\"/\"&A$1)),ROW(V16)),\"\")","v":""}]
[null,null,null,"муж.гр",null,"жен.гр",null,null,null,null,null,null,null,null,null,null,null,null,null,null,null,{"$f":"IFERROR(SMALL(IF(D$3:L$14,--(D$3:L$14&\"/\"&C$3:C$14&\"/\"&A$1)),ROW(V17)),\"\")","v":""}]
[null,"1 квартал","Январь",15,120,{"$f":"D19","v":15},108,null,null,null,null,null,null,null,null,null,null,null,null,null,null,{"$f":"IFERROR(SMALL(IF(D$3:L$14,--(D$3:L$14&\"/\"&C$3:C$14&\"/\"&A$1)),ROW(V18)),\"\")","v":""}]
[null,null,"Февраль",19,152,{"$f":"D20","v":19},137,null,null,null,null,null,null,null,null,null,null,null,null,null,null,{"$f":"IFERROR(SMALL(IF(D$3:L$14,--(D$3:L$14&\"/\"&C$3:C$14&\"/\"&A$1)),ROW(V19)),\"\")","v":""}]
[null,null,"Март",21,168,21,152,null,null,null,null,null,null,null,null,null,null,null,null,null,null,{"$f":"IFERROR(SMALL(IF(D$3:L$14,--(D$3:L$14&\"/\"&C$3:C$14&\"/\"&A$1)),ROW(V20)),\"\")","v":""}]
[null,"2 квартал","Апрель",22,175,22,157]
[null,null,"Май",18,143,18,128]
[null,null,"Июнь",21,167,21,151]
[null,"3 квартал","Июль",23,184,23,165]
[null,null,"Август",21,168,21,152]
[null,null,"Сентябрь",22,176,22,158]
[null,"4 квартал","Октябрь",22,176,22,158]
[null,null,"Ноябрь",20,159,20,144]
[null,null,"Декабрь",23,183,23,163]