{"text_format":"1","workbook":"xlsx","n_sheets":3,"sheets":["Кросс-продажи","активности по подключению к ЗПП","Запланированные активности"],"not_rendered":{"charts":0,"images":0,"macros":1,"external_links":0,"defined_names":0,"comments":0,"pivot_tables":0},"unopened":[],"bounds":{"document_bytes":16777216,"sheet_cells":100000,"rows_first":2000,"rows_last":500,"rows_between":2000,"halvings":0,"cell_chars":16384,"cell_head_chars":4096},"cells_cut":0,"cells_raw":0,"read":"whole","date_system":"1900"}

{"sheet":"Кросс-продажи","index":0,"n_rows":27,"n_cols":28,"rows_kept":27,"cut":false,"hidden":false,"merged":[[4,10,4,27],[5,26,5,27],[5,10,5,13],[5,14,5,17],[5,22,5,25],[5,18,5,21]]}
["осуществление кросс-продаж"]
[]
[null,null,null,"Филиал___________________"]
[null,null,null,"отчет на дату ___________________"]
[null,null,null,null,null,null,null,null,null,null,"Результат активностей"]
[null,null,null,null,null,null,null,null,null,null,"потреб кредиты",null,null,null,"кредитные карты",null,null,null,"автокред",null,null,null,"ипотека",null,null,null,"влады"]
["пп","ФИО сотрудника филиала","ДО/ОО/СО","наименование компании","есть ли ЗПП","контактное лицо","дата активности","формат проведения встреч","кол-во присутствующих сотр-в","комментарии","кол-во заявок","кол-во одобренных","кол-во выданных","сумма выданных","кол-во заявок","кол-во одобренных","кол-во выданных","сумма выданных","кол-во заявок","кол-во одобренных","кол-во выданных","сумма выданных","кол-во заявок","кол-во одобренных","кол-во сделок","сумма выдачи","кол-во","сумма"]
[null,{"$f":"IFERROR(INDEX('Запланированные активности'!$B$9:$D$31,SMALL(IF('Запланированные активности'!$F$9:$F$31=$A$1,ROW('Запланированные активности'!$F$9:$F$31)-8),ROW()-7),MATCH(B$7,'Запланированные активности'!$B$8:$D$8,)),\"\")","v":"сидоров"},{"$f":"IFERROR(INDEX('Запланированные активности'!$B$9:$D$31,SMALL(IF('Запланированные активности'!$F$9:$F$31=$A$1,ROW('Запланированные активности'!$F$9:$F$31)-8),ROW()-7),MATCH(C$7,'Запланированные активности'!$B$8:$D$8,)),\"\")","v":"пример2"},{"$f":"IFERROR(INDEX('Запланированные активности'!$B$9:$D$31,SMALL(IF('Запланированные активности'!$F$9:$F$31=$A$1,ROW('Запланированные активности'!$F$9:$F$31)-8),ROW()-7),MATCH(D$7,'Запланированные активности'!$B$8:$D$8,)),\"\")","v":"истра"}]
[null,{"$f":"IFERROR(INDEX('Запланированные активности'!$B$9:$D$31,SMALL(IF('Запланированные активности'!$F$9:$F$31=$A$1,ROW('Запланированные активности'!$F$9:$F$31)-8),ROW()-7),MATCH(B$7,'Запланированные активности'!$B$8:$D$8,)),\"\")","v":""},{"$f":"IFERROR(INDEX('Запланированные активности'!$B$9:$D$31,SMALL(IF('Запланированные активности'!$F$9:$F$31=$A$1,ROW('Запланированные активности'!$F$9:$F$31)-8),ROW()-7),MATCH(C$7,'Запланированные активности'!$B$8:$D$8,)),\"\")","v":""},{"$f":"IFERROR(INDEX('Запланированные активности'!$B$9:$D$31,SMALL(IF('Запланированные активности'!$F$9:$F$31=$A$1,ROW('Запланированные активности'!$F$9:$F$31)-8),ROW()-7),MATCH(D$7,'Запланированные активности'!$B$8:$D$8,)),\"\")","v":""}]
[null,{"$f":"IFERROR(INDEX('Запланированные активности'!$B$9:$D$31,SMALL(IF('Запланированные активности'!$F$9:$F$31=$A$1,ROW('Запланированные активности'!$F$9:$F$31)-8),ROW()-7),MATCH(B$7,'Запланированные активности'!$B$8:$D$8,)),\"\")","v":""},{"$f":"IFERROR(INDEX('Запланированные активности'!$B$9:$D$31,SMALL(IF('Запланированные активности'!$F$9:$F$31=$A$1,ROW('Запланированные активности'!$F$9:$F$31)-8),ROW()-7),MATCH(C$7,'Запланированные активности'!$B$8:$D$8,)),\"\")","v":""},{"$f":"IFERROR(INDEX('Запланированные активности'!$B$9:$D$31,SMALL(IF('Запланированные активности'!$F$9:$F$31=$A$1,ROW('Запланированные активности'!$F$9:$F$31)-8),ROW()-7),MATCH(D$7,'Запланированные активности'!$B$8:$D$8,)),\"\")","v":""}]
[null,{"$f":"IFERROR(INDEX('Запланированные активности'!$B$9:$D$31,SMALL(IF('Запланированные активности'!$F$9:$F$31=$A$1,ROW('Запланированные активности'!$F$9:$F$31)-8),ROW()-7),MATCH(B$7,'Запланированные активности'!$B$8:$D$8,)),\"\")","v":""},{"$f":"IFERROR(INDEX('Запланированные активности'!$B$9:$D$31,SMALL(IF('Запланированные активности'!$F$9:$F$31=$A$1,ROW('Запланированные активности'!$F$9:$F$31)-8),ROW()-7),MATCH(C$7,'Запланированные активности'!$B$8:$D$8,)),\"\")","v":""},{"$f":"IFERROR(INDEX('Запланированные активности'!$B$9:$D$31,SMALL(IF('Запланированные активности'!$F$9:$F$31=$A$1,ROW('Запланированные активности'!$F$9:$F$31)-8),ROW()-7),MATCH(D$7,'Запланированные активности'!$B$8:$D$8,)),\"\")","v":""}]
[null,{"$f":"IFERROR(INDEX('Запланированные активности'!$B$9:$D$31,SMALL(IF('Запланированные активности'!$F$9:$F$31=$A$1,ROW('Запланированные активности'!$F$9:$F$31)-8),ROW()-7),MATCH(B$7,'Запланированные активности'!$B$8:$D$8,)),\"\")","v":""},{"$f":"IFERROR(INDEX('Запланированные активности'!$B$9:$D$31,SMALL(IF('Запланированные активности'!$F$9:$F$31=$A$1,ROW('Запланированные активности'!$F$9:$F$31)-8),ROW()-7),MATCH(C$7,'Запланированные активности'!$B$8:$D$8,)),\"\")","v":""},{"$f":"IFERROR(INDEX('Запланированные активности'!$B$9:$D$31,SMALL(IF('Запланированные активности'!$F$9:$F$31=$A$1,ROW('Запланированные активности'!$F$9:$F$31)-8),ROW()-7),MATCH(D$7,'Запланированные активности'!$B$8:$D$8,)),\"\")","v":""}]
[null,{"$f":"IFERROR(INDEX('Запланированные активности'!$B$9:$D$31,SMALL(IF('Запланированные активности'!$F$9:$F$31=$A$1,ROW('Запланированные активности'!$F$9:$F$31)-8),ROW()-7),MATCH(B$7,'Запланированные активности'!$B$8:$D$8,)),\"\")","v":""},{"$f":"IFERROR(INDEX('Запланированные активности'!$B$9:$D$31,SMALL(IF('Запланированные активности'!$F$9:$F$31=$A$1,ROW('Запланированные активности'!$F$9:$F$31)-8),ROW()-7),MATCH(C$7,'Запланированные активности'!$B$8:$D$8,)),\"\")","v":""},{"$f":"IFERROR(INDEX('Запланированные активности'!$B$9:$D$31,SMALL(IF('Запланированные активности'!$F$9:$F$31=$A$1,ROW('Запланированные активности'!$F$9:$F$31)-8),ROW()-7),MATCH(D$7,'Запланированные активности'!$B$8:$D$8,)),\"\")","v":""}]
[null,{"$f":"IFERROR(INDEX('Запланированные активности'!$B$9:$D$31,SMALL(IF('Запланированные активности'!$F$9:$F$31=$A$1,ROW('Запланированные активности'!$F$9:$F$31)-8),ROW()-7),MATCH(B$7,'Запланированные активности'!$B$8:$D$8,)),\"\")","v":""},{"$f":"IFERROR(INDEX('Запланированные активности'!$B$9:$D$31,SMALL(IF('Запланированные активности'!$F$9:$F$31=$A$1,ROW('Запланированные активности'!$F$9:$F$31)-8),ROW()-7),MATCH(C$7,'Запланированные активности'!$B$8:$D$8,)),\"\")","v":""},{"$f":"IFERROR(INDEX('Запланированные активности'!$B$9:$D$31,SMALL(IF('Запланированные активности'!$F$9:$F$31=$A$1,ROW('Запланированные активности'!$F$9:$F$31)-8),ROW()-7),MATCH(D$7,'Запланированные активности'!$B$8:$D$8,)),\"\")","v":""}]
[null,{"$f":"IFERROR(INDEX('Запланированные активности'!$B$9:$D$31,SMALL(IF('Запланированные активности'!$F$9:$F$31=$A$1,ROW('Запланированные активности'!$F$9:$F$31)-8),ROW()-7),MATCH(B$7,'Запланированные активности'!$B$8:$D$8,)),\"\")","v":""},{"$f":"IFERROR(INDEX('Запланированные активности'!$B$9:$D$31,SMALL(IF('Запланированные активности'!$F$9:$F$31=$A$1,ROW('Запланированные активности'!$F$9:$F$31)-8),ROW()-7),MATCH(C$7,'Запланированные активности'!$B$8:$D$8,)),\"\")","v":""},{"$f":"IFERROR(INDEX('Запланированные активности'!$B$9:$D$31,SMALL(IF('Запланированные активности'!$F$9:$F$31=$A$1,ROW('Запланированные активности'!$F$9:$F$31)-8),ROW()-7),MATCH(D$7,'Запланированные активности'!$B$8:$D$8,)),\"\")","v":""}]
[null,{"$f":"IFERROR(INDEX('Запланированные активности'!$B$9:$D$31,SMALL(IF('Запланированные активности'!$F$9:$F$31=$A$1,ROW('Запланированные активности'!$F$9:$F$31)-8),ROW()-7),MATCH(B$7,'Запланированные активности'!$B$8:$D$8,)),\"\")","v":""},{"$f":"IFERROR(INDEX('Запланированные активности'!$B$9:$D$31,SMALL(IF('Запланированные активности'!$F$9:$F$31=$A$1,ROW('Запланированные активности'!$F$9:$F$31)-8),ROW()-7),MATCH(C$7,'Запланированные активности'!$B$8:$D$8,)),\"\")","v":""},{"$f":"IFERROR(INDEX('Запланированные активности'!$B$9:$D$31,SMALL(IF('Запланированные активности'!$F$9:$F$31=$A$1,ROW('Запланированные активности'!$F$9:$F$31)-8),ROW()-7),MATCH(D$7,'Запланированные активности'!$B$8:$D$8,)),\"\")","v":""}]
[null,{"$f":"IFERROR(INDEX('Запланированные активности'!$B$9:$D$31,SMALL(IF('Запланированные активности'!$F$9:$F$31=$A$1,ROW('Запланированные активности'!$F$9:$F$31)-8),ROW()-7),MATCH(B$7,'Запланированные активности'!$B$8:$D$8,)),\"\")","v":""},{"$f":"IFERROR(INDEX('Запланированные активности'!$B$9:$D$31,SMALL(IF('Запланированные активности'!$F$9:$F$31=$A$1,ROW('Запланированные активности'!$F$9:$F$31)-8),ROW()-7),MATCH(C$7,'Запланированные активности'!$B$8:$D$8,)),\"\")","v":""},{"$f":"IFERROR(INDEX('Запланированные активности'!$B$9:$D$31,SMALL(IF('Запланированные активности'!$F$9:$F$31=$A$1,ROW('Запланированные активности'!$F$9:$F$31)-8),ROW()-7),MATCH(D$7,'Запланированные активности'!$B$8:$D$8,)),\"\")","v":""}]
[null,{"$f":"IFERROR(INDEX('Запланированные активности'!$B$9:$D$31,SMALL(IF('Запланированные активности'!$F$9:$F$31=$A$1,ROW('Запланированные активности'!$F$9:$F$31)-8),ROW()-7),MATCH(B$7,'Запланированные активности'!$B$8:$D$8,)),\"\")","v":""},{"$f":"IFERROR(INDEX('Запланированные активности'!$B$9:$D$31,SMALL(IF('Запланированные активности'!$F$9:$F$31=$A$1,ROW('Запланированные активности'!$F$9:$F$31)-8),ROW()-7),MATCH(C$7,'Запланированные активности'!$B$8:$D$8,)),\"\")","v":""},{"$f":"IFERROR(INDEX('Запланированные активности'!$B$9:$D$31,SMALL(IF('Запланированные активности'!$F$9:$F$31=$A$1,ROW('Запланированные активности'!$F$9:$F$31)-8),ROW()-7),MATCH(D$7,'Запланированные активности'!$B$8:$D$8,)),\"\")","v":""}]
[null,{"$f":"IFERROR(INDEX('Запланированные активности'!$B$9:$D$31,SMALL(IF('Запланированные активности'!$F$9:$F$31=$A$1,ROW('Запланированные активности'!$F$9:$F$31)-8),ROW()-7),MATCH(B$7,'Запланированные активности'!$B$8:$D$8,)),\"\")","v":""},{"$f":"IFERROR(INDEX('Запланированные активности'!$B$9:$D$31,SMALL(IF('Запланированные активности'!$F$9:$F$31=$A$1,ROW('Запланированные активности'!$F$9:$F$31)-8),ROW()-7),MATCH(C$7,'Запланированные активности'!$B$8:$D$8,)),\"\")","v":""},{"$f":"IFERROR(INDEX('Запланированные активности'!$B$9:$D$31,SMALL(IF('Запланированные активности'!$F$9:$F$31=$A$1,ROW('Запланированные активности'!$F$9:$F$31)-8),ROW()-7),MATCH(D$7,'Запланированные активности'!$B$8:$D$8,)),\"\")","v":""}]
[null,{"$f":"IFERROR(INDEX('Запланированные активности'!$B$9:$D$31,SMALL(IF('Запланированные активности'!$F$9:$F$31=$A$1,ROW('Запланированные активности'!$F$9:$F$31)-8),ROW()-7),MATCH(B$7,'Запланированные активности'!$B$8:$D$8,)),\"\")","v":""},{"$f":"IFERROR(INDEX('Запланированные активности'!$B$9:$D$31,SMALL(IF('Запланированные активности'!$F$9:$F$31=$A$1,ROW('Запланированные активности'!$F$9:$F$31)-8),ROW()-7),MATCH(C$7,'Запланированные активности'!$B$8:$D$8,)),\"\")","v":""},{"$f":"IFERROR(INDEX('Запланированные активности'!$B$9:$D$31,SMALL(IF('Запланированные активности'!$F$9:$F$31=$A$1,ROW('Запланированные активности'!$F$9:$F$31)-8),ROW()-7),MATCH(D$7,'Запланированные активности'!$B$8:$D$8,)),\"\")","v":""}]
{"$rows_left_out":8}
{"sheet":"активности по подключению к ЗПП","index":1,"n_rows":27,"n_cols":19,"rows_kept":27,"cut":false,"hidden":false,"merged":[[5,11,5,18],[5,5,5,10]]}
["заключение ЗПП"]
[null,"Еженедельный отчет"]
[null,"Филиал___________________"]
[null,"отчет на дату ___________________"]
[]
[null,null,null,null,null,"Преговоры",null,null,null,null,null,"Сведения о компании"]
["пп","ДО/ОО/СО","ФИО сотрудника филиала","наименование компании","Принад-ть к группе","Дата контакта","Формат контакта","Результат переговоров","Причины отказа","Доп. условия для перехода на ЗП","Комментарии филиала","Кол-во сотрудников","ФОТ (Фонд оплаты труда)","Банк, обслуживающий ЗП проект","Наличие ковенанты","Плата за зачисление","Доп. Сведения об условиях ЗП","Контактное лицо","Телефон контактного лица"]
[null,{"$f":"IFERROR(INDEX('Запланированные активности'!$B$9:$D$31,SMALL(IF('Запланированные активности'!$F$9:$F$31=$A$1,ROW('Запланированные активности'!$F$9:$F$31)-8),ROW()-7),MATCH(B$7,'Запланированные активности'!$B$8:$D$8,)),\"\")","v":"пример 1"},{"$f":"IFERROR(INDEX('Запланированные активности'!$B$9:$D$31,SMALL(IF('Запланированные активности'!$F$9:$F$31=$A$1,ROW('Запланированные активности'!$F$9:$F$31)-8),ROW()-7),MATCH(C$7,'Запланированные активности'!$B$8:$D$8,)),\"\")","v":"попов"},{"$f":"IFERROR(INDEX('Запланированные активности'!$B$9:$D$31,SMALL(IF('Запланированные активности'!$F$9:$F$31=$A$1,ROW('Запланированные активности'!$F$9:$F$31)-8),ROW()-7),MATCH(D$7,'Запланированные активности'!$B$8:$D$8,)),\"\")","v":"капля"}]
[null,{"$f":"IFERROR(INDEX('Запланированные активности'!$B$9:$D$31,SMALL(IF('Запланированные активности'!$F$9:$F$31=$A$1,ROW('Запланированные активности'!$F$9:$F$31)-8),ROW()-7),MATCH(B$7,'Запланированные активности'!$B$8:$D$8,)),\"\")","v":"пример3"},{"$f":"IFERROR(INDEX('Запланированные активности'!$B$9:$D$31,SMALL(IF('Запланированные активности'!$F$9:$F$31=$A$1,ROW('Запланированные активности'!$F$9:$F$31)-8),ROW()-7),MATCH(C$7,'Запланированные активности'!$B$8:$D$8,)),\"\")","v":"иванов"},{"$f":"IFERROR(INDEX('Запланированные активности'!$B$9:$D$31,SMALL(IF('Запланированные активности'!$F$9:$F$31=$A$1,ROW('Запланированные активности'!$F$9:$F$31)-8),ROW()-7),MATCH(D$7,'Запланированные активности'!$B$8:$D$8,)),\"\")","v":"мак"}]
[null,{"$f":"IFERROR(INDEX('Запланированные активности'!$B$9:$D$31,SMALL(IF('Запланированные активности'!$F$9:$F$31=$A$1,ROW('Запланированные активности'!$F$9:$F$31)-8),ROW()-7),MATCH(B$7,'Запланированные активности'!$B$8:$D$8,)),\"\")","v":""},{"$f":"IFERROR(INDEX('Запланированные активности'!$B$9:$D$31,SMALL(IF('Запланированные активности'!$F$9:$F$31=$A$1,ROW('Запланированные активности'!$F$9:$F$31)-8),ROW()-7),MATCH(C$7,'Запланированные активности'!$B$8:$D$8,)),\"\")","v":""},{"$f":"IFERROR(INDEX('Запланированные активности'!$B$9:$D$31,SMALL(IF('Запланированные активности'!$F$9:$F$31=$A$1,ROW('Запланированные активности'!$F$9:$F$31)-8),ROW()-7),MATCH(D$7,'Запланированные активности'!$B$8:$D$8,)),\"\")","v":""}]
[null,{"$f":"IFERROR(INDEX('Запланированные активности'!$B$9:$D$31,SMALL(IF('Запланированные активности'!$F$9:$F$31=$A$1,ROW('Запланированные активности'!$F$9:$F$31)-8),ROW()-7),MATCH(B$7,'Запланированные активности'!$B$8:$D$8,)),\"\")","v":""},{"$f":"IFERROR(INDEX('Запланированные активности'!$B$9:$D$31,SMALL(IF('Запланированные активности'!$F$9:$F$31=$A$1,ROW('Запланированные активности'!$F$9:$F$31)-8),ROW()-7),MATCH(C$7,'Запланированные активности'!$B$8:$D$8,)),\"\")","v":""},{"$f":"IFERROR(INDEX('Запланированные активности'!$B$9:$D$31,SMALL(IF('Запланированные активности'!$F$9:$F$31=$A$1,ROW('Запланированные активности'!$F$9:$F$31)-8),ROW()-7),MATCH(D$7,'Запланированные активности'!$B$8:$D$8,)),\"\")","v":""}]
[null,{"$f":"IFERROR(INDEX('Запланированные активности'!$B$9:$D$31,SMALL(IF('Запланированные активности'!$F$9:$F$31=$A$1,ROW('Запланированные активности'!$F$9:$F$31)-8),ROW()-7),MATCH(B$7,'Запланированные активности'!$B$8:$D$8,)),\"\")","v":""},{"$f":"IFERROR(INDEX('Запланированные активности'!$B$9:$D$31,SMALL(IF('Запланированные активности'!$F$9:$F$31=$A$1,ROW('Запланированные активности'!$F$9:$F$31)-8),ROW()-7),MATCH(C$7,'Запланированные активности'!$B$8:$D$8,)),\"\")","v":""},{"$f":"IFERROR(INDEX('Запланированные активности'!$B$9:$D$31,SMALL(IF('Запланированные активности'!$F$9:$F$31=$A$1,ROW('Запланированные активности'!$F$9:$F$31)-8),ROW()-7),MATCH(D$7,'Запланированные активности'!$B$8:$D$8,)),\"\")","v":""}]
[null,{"$f":"IFERROR(INDEX('Запланированные активности'!$B$9:$D$31,SMALL(IF('Запланированные активности'!$F$9:$F$31=$A$1,ROW('Запланированные активности'!$F$9:$F$31)-8),ROW()-7),MATCH(B$7,'Запланированные активности'!$B$8:$D$8,)),\"\")","v":""},{"$f":"IFERROR(INDEX('Запланированные активности'!$B$9:$D$31,SMALL(IF('Запланированные активности'!$F$9:$F$31=$A$1,ROW('Запланированные активности'!$F$9:$F$31)-8),ROW()-7),MATCH(C$7,'Запланированные активности'!$B$8:$D$8,)),\"\")","v":""},{"$f":"IFERROR(INDEX('Запланированные активности'!$B$9:$D$31,SMALL(IF('Запланированные активности'!$F$9:$F$31=$A$1,ROW('Запланированные активности'!$F$9:$F$31)-8),ROW()-7),MATCH(D$7,'Запланированные активности'!$B$8:$D$8,)),\"\")","v":""}]
[null,{"$f":"IFERROR(INDEX('Запланированные активности'!$B$9:$D$31,SMALL(IF('Запланированные активности'!$F$9:$F$31=$A$1,ROW('Запланированные активности'!$F$9:$F$31)-8),ROW()-7),MATCH(B$7,'Запланированные активности'!$B$8:$D$8,)),\"\")","v":""},{"$f":"IFERROR(INDEX('Запланированные активности'!$B$9:$D$31,SMALL(IF('Запланированные активности'!$F$9:$F$31=$A$1,ROW('Запланированные активности'!$F$9:$F$31)-8),ROW()-7),MATCH(C$7,'Запланированные активности'!$B$8:$D$8,)),\"\")","v":""},{"$f":"IFERROR(INDEX('Запланированные активности'!$B$9:$D$31,SMALL(IF('Запланированные активности'!$F$9:$F$31=$A$1,ROW('Запланированные активности'!$F$9:$F$31)-8),ROW()-7),MATCH(D$7,'Запланированные активности'!$B$8:$D$8,)),\"\")","v":""}]
[null,{"$f":"IFERROR(INDEX('Запланированные активности'!$B$9:$D$31,SMALL(IF('Запланированные активности'!$F$9:$F$31=$A$1,ROW('Запланированные активности'!$F$9:$F$31)-8),ROW()-7),MATCH(B$7,'Запланированные активности'!$B$8:$D$8,)),\"\")","v":""},{"$f":"IFERROR(INDEX('Запланированные активности'!$B$9:$D$31,SMALL(IF('Запланированные активности'!$F$9:$F$31=$A$1,ROW('Запланированные активности'!$F$9:$F$31)-8),ROW()-7),MATCH(C$7,'Запланированные активности'!$B$8:$D$8,)),\"\")","v":""},{"$f":"IFERROR(INDEX('Запланированные активности'!$B$9:$D$31,SMALL(IF('Запланированные активности'!$F$9:$F$31=$A$1,ROW('Запланированные активности'!$F$9:$F$31)-8),ROW()-7),MATCH(D$7,'Запланированные активности'!$B$8:$D$8,)),\"\")","v":""}]
[null,{"$f":"IFERROR(INDEX('Запланированные активности'!$B$9:$D$31,SMALL(IF('Запланированные активности'!$F$9:$F$31=$A$1,ROW('Запланированные активности'!$F$9:$F$31)-8),ROW()-7),MATCH(B$7,'Запланированные активности'!$B$8:$D$8,)),\"\")","v":""},{"$f":"IFERROR(INDEX('Запланированные активности'!$B$9:$D$31,SMALL(IF('Запланированные активности'!$F$9:$F$31=$A$1,ROW('Запланированные активности'!$F$9:$F$31)-8),ROW()-7),MATCH(C$7,'Запланированные активности'!$B$8:$D$8,)),\"\")","v":""},{"$f":"IFERROR(INDEX('Запланированные активности'!$B$9:$D$31,SMALL(IF('Запланированные активности'!$F$9:$F$31=$A$1,ROW('Запланированные активности'!$F$9:$F$31)-8),ROW()-7),MATCH(D$7,'Запланированные активности'!$B$8:$D$8,)),\"\")","v":""}]
[null,{"$f":"IFERROR(INDEX('Запланированные активности'!$B$9:$D$31,SMALL(IF('Запланированные активности'!$F$9:$F$31=$A$1,ROW('Запланированные активности'!$F$9:$F$31)-8),ROW()-7),MATCH(B$7,'Запланированные активности'!$B$8:$D$8,)),\"\")","v":""},{"$f":"IFERROR(INDEX('Запланированные активности'!$B$9:$D$31,SMALL(IF('Запланированные активности'!$F$9:$F$31=$A$1,ROW('Запланированные активности'!$F$9:$F$31)-8),ROW()-7),MATCH(C$7,'Запланированные активности'!$B$8:$D$8,)),\"\")","v":""},{"$f":"IFERROR(INDEX('Запланированные активности'!$B$9:$D$31,SMALL(IF('Запланированные активности'!$F$9:$F$31=$A$1,ROW('Запланированные активности'!$F$9:$F$31)-8),ROW()-7),MATCH(D$7,'Запланированные активности'!$B$8:$D$8,)),\"\")","v":""}]
[null,{"$f":"IFERROR(INDEX('Запланированные активности'!$B$9:$D$31,SMALL(IF('Запланированные активности'!$F$9:$F$31=$A$1,ROW('Запланированные активности'!$F$9:$F$31)-8),ROW()-7),MATCH(B$7,'Запланированные активности'!$B$8:$D$8,)),\"\")","v":""},{"$f":"IFERROR(INDEX('Запланированные активности'!$B$9:$D$31,SMALL(IF('Запланированные активности'!$F$9:$F$31=$A$1,ROW('Запланированные активности'!$F$9:$F$31)-8),ROW()-7),MATCH(C$7,'Запланированные активности'!$B$8:$D$8,)),\"\")","v":""},{"$f":"IFERROR(INDEX('Запланированные активности'!$B$9:$D$31,SMALL(IF('Запланированные активности'!$F$9:$F$31=$A$1,ROW('Запланированные активности'!$F$9:$F$31)-8),ROW()-7),MATCH(D$7,'Запланированные активности'!$B$8:$D$8,)),\"\")","v":""}]
[null,{"$f":"IFERROR(INDEX('Запланированные активности'!$B$9:$D$31,SMALL(IF('Запланированные активности'!$F$9:$F$31=$A$1,ROW('Запланированные активности'!$F$9:$F$31)-8),ROW()-7),MATCH(B$7,'Запланированные активности'!$B$8:$D$8,)),\"\")","v":""},{"$f":"IFERROR(INDEX('Запланированные активности'!$B$9:$D$31,SMALL(IF('Запланированные активности'!$F$9:$F$31=$A$1,ROW('Запланированные активности'!$F$9:$F$31)-8),ROW()-7),MATCH(C$7,'Запланированные активности'!$B$8:$D$8,)),\"\")","v":""},{"$f":"IFERROR(INDEX('Запланированные активности'!$B$9:$D$31,SMALL(IF('Запланированные активности'!$F$9:$F$31=$A$1,ROW('Запланированные активности'!$F$9:$F$31)-8),ROW()-7),MATCH(D$7,'Запланированные активности'!$B$8:$D$8,)),\"\")","v":""}]
[null,{"$f":"IFERROR(INDEX('Запланированные активности'!$B$9:$D$31,SMALL(IF('Запланированные активности'!$F$9:$F$31=$A$1,ROW('Запланированные активности'!$F$9:$F$31)-8),ROW()-7),MATCH(B$7,'Запланированные активности'!$B$8:$D$8,)),\"\")","v":""},{"$f":"IFERROR(INDEX('Запланированные активности'!$B$9:$D$31,SMALL(IF('Запланированные активности'!$F$9:$F$31=$A$1,ROW('Запланированные активности'!$F$9:$F$31)-8),ROW()-7),MATCH(C$7,'Запланированные активности'!$B$8:$D$8,)),\"\")","v":""},{"$f":"IFERROR(INDEX('Запланированные активности'!$B$9:$D$31,SMALL(IF('Запланированные активности'!$F$9:$F$31=$A$1,ROW('Запланированные активности'!$F$9:$F$31)-8),ROW()-7),MATCH(D$7,'Запланированные активности'!$B$8:$D$8,)),\"\")","v":""}]
{"$rows_left_out":8}
{"sheet":"Запланированные активности","index":2,"n_rows":11,"n_cols":11,"rows_kept":11,"cut":false,"hidden":false,"merged":[]}
[]
[]
["Филиал___________________"]
["отчет на дату ___________________"]
[]
[]
[]
["пп","ДО/ОО/СО","ФИО сотрудника филиала","наименование компании","Принад-ть к группе","Формат активности","Формат проведения переговоров","Запланированная дата проведения активности","Контактное лицо","Телефон контактного лица","Комментарии"]
[null,"пример 1","попов","капля",null,"заключение ЗПП"]
[null,"пример2","сидоров","истра",null,"осуществление кросс-продаж"]
[null,"пример3","иванов","мак",null,"заключение ЗПП"]