{"text_format":"1","workbook":"xlsx","n_sheets":4,"sheets":["СПИСОК СОТРУДНИКОВ","03","СТАТИСТИКА","Лист1"],"not_rendered":{"charts":0,"images":0,"macros":1,"external_links":0,"defined_names":5,"comments":0,"pivot_tables":0},"unopened":[],"bounds":{"document_bytes":16777216,"sheet_cells":100000,"rows_first":2000,"rows_last":500,"rows_between":2000,"halvings":0,"cell_chars":16384,"cell_head_chars":4096},"cells_cut":0,"cells_raw":0,"read":"whole","date_system":"1900"}

{"sheet":"СПИСОК СОТРУДНИКОВ","index":0,"n_rows":499,"n_cols":4,"rows_kept":499,"cut":false,"hidden":false,"merged":[]}
["№   п/п","за ЄРК","№ ТАБЕЛЯ","ФИО"]
[1,null,1,"А"]
[2,null,2,"Б"]
[{"$f":"IF(AND(A3-A2=1, C3>0), SUM(A3+1), 0)","v":3},null,3,"В"]
[4,null,4,"Г"]
[5,null,5,"Д"]
[6,null,6,"Е"]
[7,null,7,"Ж"]
[8,null,8,"З"]
[9,null,9,"И"]
[10,null,10,"К"]
[11,null,11,"Л"]
[12,null,12,"М"]
[13,null,13,"Н"]
[14,null,14,"О"]
{"$rows_left_out":485}
{"sheet":"03","index":1,"n_rows":862,"n_cols":9,"rows_kept":862,"cut":false,"hidden":false,"merged":[]}
["№",null,"ДАТА","№ ТАБЕЛЯ","Ф И О"]
[{"$f":"IF(C2>0,1, 0)","v":1},null,"2014-03-02",114,{"$f":"IF(D2=0,\" \",IF(IFERROR((VLOOKUP(D2,'СПИСОК СОТРУДНИКОВ'!$C$2:$D$1000,2,0)),\"ЗАПОЛНИ СПИСОК\")=0,\"ЗАПОЛНИ СПИСОК\",IFERROR((VLOOKUP(D2,'СПИСОК СОТРУДНИКОВ'!$C$2:$D$1000,2,0)),\"ЗАПОЛНИ СПИСОК\")))","v":"ЗАПОЛНИ СПИСОК"},null,{"$f":"IFERROR(IF(#REF!-(VLOOKUP(D2,'СПИСОК СОТРУДНИКОВ'!$C$2:$D$1000,3,0))<75,#REF!-(VLOOKUP(D2,'СПИСОК СОТРУДНИКОВ'!$C$2:$D$1000,3,0)),\"ПОМИЛКА\"),\" \")","v":" "},{"$f":"IFERROR(IF((VLOOKUP(D2,'СПИСОК СОТРУДНИКОВ'!$C$2:$D$1000,4,0))>0,(VLOOKUP(D2,'СПИСОК СОТРУДНИКОВ'!$C$2:$D$1000,4,0)),\"ПОМИЛКА\"),\" \")","v":" "}]
[{"$f":"IF(AND(A2=1, C3>0), SUM(A2+1), 0)","v":2},null,"2014-03-02",134,{"$f":"IF(D3=0,\" \",IF(IFERROR((VLOOKUP(D3,'СПИСОК СОТРУДНИКОВ'!$C$2:$D$1000,2,0)),\"ЗАПОЛНИ СПИСОК\")=0,\"ЗАПОЛНИ СПИСОК\",IFERROR((VLOOKUP(D3,'СПИСОК СОТРУДНИКОВ'!$C$2:$D$1000,2,0)),\"ЗАПОЛНИ СПИСОК\")))","v":"ЗАПОЛНИ СПИСОК"},null,{"$f":"IFERROR(IF(#REF!-(VLOOKUP(D3,'СПИСОК СОТРУДНИКОВ'!$C$2:$D$1000,3,0))<75,#REF!-(VLOOKUP(D3,'СПИСОК СОТРУДНИКОВ'!$C$2:$D$1000,3,0)),\"ПОМИЛКА\"),\" \")","v":" "},{"$f":"IFERROR(IF((VLOOKUP(D3,'СПИСОК СОТРУДНИКОВ'!$C$2:$D$1000,4,0))>0,(VLOOKUP(D3,'СПИСОК СОТРУДНИКОВ'!$C$2:$D$1000,4,0)),\"ПОМИЛКА\"),\" \")","v":" "}]
[{"$f":"IF(AND(A3-A2=1, C4>0), SUM(A3+1), 0)","v":3},null,"2014-03-02",84,{"$f":"IF(D4=0,\" \",IF(IFERROR((VLOOKUP(D4,'СПИСОК СОТРУДНИКОВ'!$C$2:$D$1000,2,0)),\"ЗАПОЛНИ СПИСОК\")=0,\"ЗАПОЛНИ СПИСОК\",IFERROR((VLOOKUP(D4,'СПИСОК СОТРУДНИКОВ'!$C$2:$D$1000,2,0)),\"ЗАПОЛНИ СПИСОК\")))","v":"ЗАПОЛНИ СПИСОК"},null,{"$f":"IFERROR(IF(#REF!-(VLOOKUP(D4,'СПИСОК СОТРУДНИКОВ'!$C$2:$D$1000,3,0))<75,#REF!-(VLOOKUP(D4,'СПИСОК СОТРУДНИКОВ'!$C$2:$D$1000,3,0)),\"ПОМИЛКА\"),\" \")","v":" "},{"$f":"IFERROR(IF((VLOOKUP(D4,'СПИСОК СОТРУДНИКОВ'!$C$2:$D$1000,4,0))>0,(VLOOKUP(D4,'СПИСОК СОТРУДНИКОВ'!$C$2:$D$1000,4,0)),\"ПОМИЛКА\"),\" \")","v":" "}]
[4,null,"2014-03-02",1,{"$f":"IF(D5=0,\" \",IF(IFERROR((VLOOKUP(D5,'СПИСОК СОТРУДНИКОВ'!$C$2:$D$1000,2,0)),\"ЗАПОЛНИ СПИСОК\")=0,\"ЗАПОЛНИ СПИСОК\",IFERROR((VLOOKUP(D5,'СПИСОК СОТРУДНИКОВ'!$C$2:$D$1000,2,0)),\"ЗАПОЛНИ СПИСОК\")))","v":"А"},null,{"$f":"IFERROR(IF(#REF!-(VLOOKUP(D5,'СПИСОК СОТРУДНИКОВ'!$C$2:$D$1000,3,0))<75,#REF!-(VLOOKUP(D5,'СПИСОК СОТРУДНИКОВ'!$C$2:$D$1000,3,0)),\"ПОМИЛКА\"),\" \")","v":" "},{"$f":"IFERROR(IF((VLOOKUP(D5,'СПИСОК СОТРУДНИКОВ'!$C$2:$D$1000,4,0))>0,(VLOOKUP(D5,'СПИСОК СОТРУДНИКОВ'!$C$2:$D$1000,4,0)),\"ПОМИЛКА\"),\" \")","v":" "}]
[5,null,"2014-03-02",117,{"$f":"IF(D6=0,\" \",IF(IFERROR((VLOOKUP(D6,'СПИСОК СОТРУДНИКОВ'!$C$2:$D$1000,2,0)),\"ЗАПОЛНИ СПИСОК\")=0,\"ЗАПОЛНИ СПИСОК\",IFERROR((VLOOKUP(D6,'СПИСОК СОТРУДНИКОВ'!$C$2:$D$1000,2,0)),\"ЗАПОЛНИ СПИСОК\")))","v":"ЗАПОЛНИ СПИСОК"},null,{"$f":"IFERROR(IF(#REF!-(VLOOKUP(D6,'СПИСОК СОТРУДНИКОВ'!$C$2:$D$1000,3,0))<75,#REF!-(VLOOKUP(D6,'СПИСОК СОТРУДНИКОВ'!$C$2:$D$1000,3,0)),\"ПОМИЛКА\"),\" \")","v":" "},{"$f":"IFERROR(IF((VLOOKUP(D6,'СПИСОК СОТРУДНИКОВ'!$C$2:$D$1000,4,0))>0,(VLOOKUP(D6,'СПИСОК СОТРУДНИКОВ'!$C$2:$D$1000,4,0)),\"ПОМИЛКА\"),\" \")","v":" "}]
[6,null,"2014-03-02",28,{"$f":"IF(D7=0,\" \",IF(IFERROR((VLOOKUP(D7,'СПИСОК СОТРУДНИКОВ'!$C$2:$D$1000,2,0)),\"ЗАПОЛНИ СПИСОК\")=0,\"ЗАПОЛНИ СПИСОК\",IFERROR((VLOOKUP(D7,'СПИСОК СОТРУДНИКОВ'!$C$2:$D$1000,2,0)),\"ЗАПОЛНИ СПИСОК\")))","v":"УУ"},null,{"$f":"IFERROR(IF(#REF!-(VLOOKUP(D7,'СПИСОК СОТРУДНИКОВ'!$C$2:$D$1000,3,0))<75,#REF!-(VLOOKUP(D7,'СПИСОК СОТРУДНИКОВ'!$C$2:$D$1000,3,0)),\"ПОМИЛКА\"),\" \")","v":" "},{"$f":"IFERROR(IF((VLOOKUP(D7,'СПИСОК СОТРУДНИКОВ'!$C$2:$D$1000,4,0))>0,(VLOOKUP(D7,'СПИСОК СОТРУДНИКОВ'!$C$2:$D$1000,4,0)),\"ПОМИЛКА\"),\" \")","v":" "}]
[7,null,"2014-03-02",3,{"$f":"IF(D8=0,\" \",IF(IFERROR((VLOOKUP(D8,'СПИСОК СОТРУДНИКОВ'!$C$2:$D$1000,2,0)),\"ЗАПОЛНИ СПИСОК\")=0,\"ЗАПОЛНИ СПИСОК\",IFERROR((VLOOKUP(D8,'СПИСОК СОТРУДНИКОВ'!$C$2:$D$1000,2,0)),\"ЗАПОЛНИ СПИСОК\")))","v":"В"},null,{"$f":"IFERROR(IF(#REF!-(VLOOKUP(D8,'СПИСОК СОТРУДНИКОВ'!$C$2:$D$1000,3,0))<75,#REF!-(VLOOKUP(D8,'СПИСОК СОТРУДНИКОВ'!$C$2:$D$1000,3,0)),\"ПОМИЛКА\"),\" \")","v":" "},{"$f":"IFERROR(IF((VLOOKUP(D8,'СПИСОК СОТРУДНИКОВ'!$C$2:$D$1000,4,0))>0,(VLOOKUP(D8,'СПИСОК СОТРУДНИКОВ'!$C$2:$D$1000,4,0)),\"ПОМИЛКА\"),\" \")","v":" "}]
[8,null,"2014-03-02",28,{"$f":"IF(D9=0,\" \",IF(IFERROR((VLOOKUP(D9,'СПИСОК СОТРУДНИКОВ'!$C$2:$D$1000,2,0)),\"ЗАПОЛНИ СПИСОК\")=0,\"ЗАПОЛНИ СПИСОК\",IFERROR((VLOOKUP(D9,'СПИСОК СОТРУДНИКОВ'!$C$2:$D$1000,2,0)),\"ЗАПОЛНИ СПИСОК\")))","v":"УУ"},null,{"$f":"IFERROR(IF(#REF!-(VLOOKUP(D9,'СПИСОК СОТРУДНИКОВ'!$C$2:$D$1000,3,0))<75,#REF!-(VLOOKUP(D9,'СПИСОК СОТРУДНИКОВ'!$C$2:$D$1000,3,0)),\"ПОМИЛКА\"),\" \")","v":" "},{"$f":"IFERROR(IF((VLOOKUP(D9,'СПИСОК СОТРУДНИКОВ'!$C$2:$D$1000,4,0))>0,(VLOOKUP(D9,'СПИСОК СОТРУДНИКОВ'!$C$2:$D$1000,4,0)),\"ПОМИЛКА\"),\" \")","v":" "}]
[9,null,"2014-03-02",110,{"$f":"IF(D10=0,\" \",IF(IFERROR((VLOOKUP(D10,'СПИСОК СОТРУДНИКОВ'!$C$2:$D$1000,2,0)),\"ЗАПОЛНИ СПИСОК\")=0,\"ЗАПОЛНИ СПИСОК\",IFERROR((VLOOKUP(D10,'СПИСОК СОТРУДНИКОВ'!$C$2:$D$1000,2,0)),\"ЗАПОЛНИ СПИСОК\")))","v":"ЗАПОЛНИ СПИСОК"},null,{"$f":"IFERROR(IF(#REF!-(VLOOKUP(D10,'СПИСОК СОТРУДНИКОВ'!$C$2:$D$1000,3,0))<75,#REF!-(VLOOKUP(D10,'СПИСОК СОТРУДНИКОВ'!$C$2:$D$1000,3,0)),\"ПОМИЛКА\"),\" \")","v":" "},{"$f":"IFERROR(IF((VLOOKUP(D10,'СПИСОК СОТРУДНИКОВ'!$C$2:$D$1000,4,0))>0,(VLOOKUP(D10,'СПИСОК СОТРУДНИКОВ'!$C$2:$D$1000,4,0)),\"ПОМИЛКА\"),\" \")","v":" "}]
[10,null,"2014-03-02",108,{"$f":"IF(D11=0,\" \",IF(IFERROR((VLOOKUP(D11,'СПИСОК СОТРУДНИКОВ'!$C$2:$D$1000,2,0)),\"ЗАПОЛНИ СПИСОК\")=0,\"ЗАПОЛНИ СПИСОК\",IFERROR((VLOOKUP(D11,'СПИСОК СОТРУДНИКОВ'!$C$2:$D$1000,2,0)),\"ЗАПОЛНИ СПИСОК\")))","v":"ЗАПОЛНИ СПИСОК"},null,{"$f":"IFERROR(IF(#REF!-(VLOOKUP(D11,'СПИСОК СОТРУДНИКОВ'!$C$2:$D$1000,3,0))<75,#REF!-(VLOOKUP(D11,'СПИСОК СОТРУДНИКОВ'!$C$2:$D$1000,3,0)),\"ПОМИЛКА\"),\" \")","v":" "},{"$f":"IFERROR(IF((VLOOKUP(D11,'СПИСОК СОТРУДНИКОВ'!$C$2:$D$1000,4,0))>0,(VLOOKUP(D11,'СПИСОК СОТРУДНИКОВ'!$C$2:$D$1000,4,0)),\"ПОМИЛКА\"),\" \")","v":" "}]
[11,null,"2014-03-02",124,{"$f":"IF(D12=0,\" \",IF(IFERROR((VLOOKUP(D12,'СПИСОК СОТРУДНИКОВ'!$C$2:$D$1000,2,0)),\"ЗАПОЛНИ СПИСОК\")=0,\"ЗАПОЛНИ СПИСОК\",IFERROR((VLOOKUP(D12,'СПИСОК СОТРУДНИКОВ'!$C$2:$D$1000,2,0)),\"ЗАПОЛНИ СПИСОК\")))","v":"ЗАПОЛНИ СПИСОК"},null,{"$f":"IFERROR(IF(#REF!-(VLOOKUP(D12,'СПИСОК СОТРУДНИКОВ'!$C$2:$D$1000,3,0))<75,#REF!-(VLOOKUP(D12,'СПИСОК СОТРУДНИКОВ'!$C$2:$D$1000,3,0)),\"ПОМИЛКА\"),\" \")","v":" "},{"$f":"IFERROR(IF((VLOOKUP(D12,'СПИСОК СОТРУДНИКОВ'!$C$2:$D$1000,4,0))>0,(VLOOKUP(D12,'СПИСОК СОТРУДНИКОВ'!$C$2:$D$1000,4,0)),\"ПОМИЛКА\"),\" \")","v":" "}]
[12,null,"2014-03-02",1,{"$f":"IF(D13=0,\" \",IF(IFERROR((VLOOKUP(D13,'СПИСОК СОТРУДНИКОВ'!$C$2:$D$1000,2,0)),\"ЗАПОЛНИ СПИСОК\")=0,\"ЗАПОЛНИ СПИСОК\",IFERROR((VLOOKUP(D13,'СПИСОК СОТРУДНИКОВ'!$C$2:$D$1000,2,0)),\"ЗАПОЛНИ СПИСОК\")))","v":"А"},null,{"$f":"IFERROR(IF(#REF!-(VLOOKUP(D13,'СПИСОК СОТРУДНИКОВ'!$C$2:$D$1000,3,0))<75,#REF!-(VLOOKUP(D13,'СПИСОК СОТРУДНИКОВ'!$C$2:$D$1000,3,0)),\"ПОМИЛКА\"),\" \")","v":" "},{"$f":"IFERROR(IF((VLOOKUP(D13,'СПИСОК СОТРУДНИКОВ'!$C$2:$D$1000,4,0))>0,(VLOOKUP(D13,'СПИСОК СОТРУДНИКОВ'!$C$2:$D$1000,4,0)),\"ПОМИЛКА\"),\" \")","v":" "}]
[13,null,"2014-03-03",76,{"$f":"IF(D14=0,\" \",IF(IFERROR((VLOOKUP(D14,'СПИСОК СОТРУДНИКОВ'!$C$2:$D$1000,2,0)),\"ЗАПОЛНИ СПИСОК\")=0,\"ЗАПОЛНИ СПИСОК\",IFERROR((VLOOKUP(D14,'СПИСОК СОТРУДНИКОВ'!$C$2:$D$1000,2,0)),\"ЗАПОЛНИ СПИСОК\")))","v":"ВВВ"},null,{"$f":"IFERROR(IF(#REF!-(VLOOKUP(D14,'СПИСОК СОТРУДНИКОВ'!$C$2:$D$1000,3,0))<75,#REF!-(VLOOKUP(D14,'СПИСОК СОТРУДНИКОВ'!$C$2:$D$1000,3,0)),\"ПОМИЛКА\"),\" \")","v":" "},{"$f":"IFERROR(IF((VLOOKUP(D14,'СПИСОК СОТРУДНИКОВ'!$C$2:$D$1000,4,0))>0,(VLOOKUP(D14,'СПИСОК СОТРУДНИКОВ'!$C$2:$D$1000,4,0)),\"ПОМИЛКА\"),\" \")","v":" "}]
[14,null,"2014-03-03",109,{"$f":"IF(D15=0,\" \",IF(IFERROR((VLOOKUP(D15,'СПИСОК СОТРУДНИКОВ'!$C$2:$D$1000,2,0)),\"ЗАПОЛНИ СПИСОК\")=0,\"ЗАПОЛНИ СПИСОК\",IFERROR((VLOOKUP(D15,'СПИСОК СОТРУДНИКОВ'!$C$2:$D$1000,2,0)),\"ЗАПОЛНИ СПИСОК\")))","v":"ЗАПОЛНИ СПИСОК"},null,{"$f":"IFERROR(IF(#REF!-(VLOOKUP(D15,'СПИСОК СОТРУДНИКОВ'!$C$2:$D$1000,3,0))<75,#REF!-(VLOOKUP(D15,'СПИСОК СОТРУДНИКОВ'!$C$2:$D$1000,3,0)),\"ПОМИЛКА\"),\" \")","v":" "},{"$f":"IFERROR(IF((VLOOKUP(D15,'СПИСОК СОТРУДНИКОВ'!$C$2:$D$1000,4,0))>0,(VLOOKUP(D15,'СПИСОК СОТРУДНИКОВ'!$C$2:$D$1000,4,0)),\"ПОМИЛКА\"),\" \")","v":" "}]
{"$rows_left_out":848}
{"sheet":"СТАТИСТИКА","index":2,"n_rows":9,"n_cols":32,"rows_kept":9,"cut":false,"hidden":false,"merged":[[0,4,0,30],[7,0,7,3],[8,1,21,21]]}
[null,null,null,null,"СТАТИСТИКА"]
["ДАТА","2014-03-01","2014-03-02","2014-03-03","2014-03-04","2014-03-05","2014-03-06","2014-03-07","2014-03-08","2014-03-09","2014-03-10","2014-03-11","2014-03-12","2014-03-13","2014-03-14","2014-03-15","2014-03-16","2014-03-17","2014-03-18","2014-03-19","2014-03-20","2014-03-21","2014-03-22","2014-03-23","2014-03-24","2014-03-25","2014-03-26","2014-03-27","2014-03-28","2014-03-29","2014-03-30","2014-03-31"]
["всего смен",{"$f":"COUNTIF('03'!$C$2:$C$472,B2)","v":0},{"$f":"COUNTIF('03'!$C$2:$C$472,C2)","v":12},{"$f":"COUNTIF('03'!$C$2:$C$472,D2)","v":26},{"$f":"COUNTIF('03'!$C$2:$C$472,E2)","v":36},{"$f":"COUNTIF('03'!$C$2:$C$472,F2)","v":33},{"$f":"COUNTIF('03'!$C$2:$C$472,G2)","v":19},{"$f":"COUNTIF('03'!$C$2:$C$472,H2)","v":22},{"$f":"COUNTIF('03'!$C$2:$C$472,I2)","v":0},{"$f":"COUNTIF('03'!$C$2:$C$472,J2)","v":17},{"$f":"COUNTIF('03'!$C$2:$C$472,K2)","v":18},{"$f":"COUNTIF('03'!$C$2:$C$472,L2)","v":20},{"$f":"COUNTIF('03'!$C$2:$C$472,M2)","v":28},{"$f":"COUNTIF('03'!$C$2:$C$472,N2)","v":32},{"$f":"COUNTIF('03'!$C$2:$C$472,O2)","v":22},{"$f":"COUNTIF('03'!$C$2:$C$472,P2)","v":0},{"$f":"COUNTIF('03'!$C$2:$C$472,Q2)","v":19},{"$f":"COUNTIF('03'!$C$2:$C$472,R2)","v":36},{"$f":"COUNTIF('03'!$C$2:$C$472,S2)","v":33},{"$f":"COUNTIF('03'!$C$2:$C$472,T2)","v":25},{"$f":"COUNTIF('03'!$C$2:$C$472,U2)","v":29},{"$f":"COUNTIF('03'!$C$2:$C$472,V2)","v":4},{"$f":"COUNTIF('03'!$C$2:$C$472,W2)","v":0},{"$f":"COUNTIF('03'!$C$2:$C$472,X2)","v":0},{"$f":"COUNTIF('03'!$C$2:$C$472,Y2)","v":0},{"$f":"COUNTIF('03'!$C$2:$C$472,Z2)","v":0},{"$f":"COUNTIF('03'!$C$2:$C$472,AA2)","v":0},{"$f":"COUNTIF('03'!$C$2:$C$472,AB2)","v":0},{"$f":"COUNTIF('03'!$C$2:$C$472,AC2)","v":0},{"$f":"COUNTIF('03'!$C$2:$C$472,AD2)","v":0},{"$f":"COUNTIF('03'!$C$2:$C$472,AE2)","v":0},{"$f":"COUNTIF('03'!$C$2:$C$472,AF2)","v":0}]
["AlexM  - короткая",{"$f":"SUM(--(FREQUENCY('03'!$D$2:$D$472*('03'!$C$2:$C$472=B2),'03'!$D$2:$D$472)>0))-1","v":0},{"$f":"SUM(--(FREQUENCY('03'!$D$2:$D$472*('03'!$C$2:$C$472=C2),'03'!$D$2:$D$472)>0))-1","v":9},{"$f":"SUM(--(FREQUENCY('03'!$D$2:$D$472*('03'!$C$2:$C$472=D2),'03'!$D$2:$D$472)>0))-1","v":21},{"$f":"SUM(--(FREQUENCY('03'!$D$2:$D$472*('03'!$C$2:$C$472=E2),'03'!$D$2:$D$472)>0))-1","v":27},{"$f":"SUM(--(FREQUENCY('03'!$D$2:$D$472*('03'!$C$2:$C$472=F2),'03'!$D$2:$D$472)>0))-1","v":28},{"$f":"SUM(--(FREQUENCY('03'!$D$2:$D$472*('03'!$C$2:$C$472=G2),'03'!$D$2:$D$472)>0))-1","v":17},{"$f":"SUM(--(FREQUENCY('03'!$D$2:$D$472*('03'!$C$2:$C$472=H2),'03'!$D$2:$D$472)>0))-1","v":17},{"$f":"SUM(--(FREQUENCY('03'!$D$2:$D$472*('03'!$C$2:$C$472=I2),'03'!$D$2:$D$472)>0))-1","v":0},{"$f":"SUM(--(FREQUENCY('03'!$D$2:$D$472*('03'!$C$2:$C$472=J2),'03'!$D$2:$D$472)>0))-1","v":11},{"$f":"SUM(--(FREQUENCY('03'!$D$2:$D$472*('03'!$C$2:$C$472=K2),'03'!$D$2:$D$472)>0))-1","v":17},{"$f":"SUM(--(FREQUENCY('03'!$D$2:$D$472*('03'!$C$2:$C$472=L2),'03'!$D$2:$D$472)>0))-1","v":17},{"$f":"SUM(--(FREQUENCY('03'!$D$2:$D$472*('03'!$C$2:$C$472=M2),'03'!$D$2:$D$472)>0))-1","v":18},{"$f":"SUM(--(FREQUENCY('03'!$D$2:$D$472*('03'!$C$2:$C$472=N2),'03'!$D$2:$D$472)>0))-1","v":27},{"$f":"SUM(--(FREQUENCY('03'!$D$2:$D$472*('03'!$C$2:$C$472=O2),'03'!$D$2:$D$472)>0))-1","v":16},{"$f":"SUM(--(FREQUENCY('03'!$D$2:$D$472*('03'!$C$2:$C$472=P2),'03'!$D$2:$D$472)>0))-1","v":0},{"$f":"SUM(--(FREQUENCY('03'!$D$2:$D$472*('03'!$C$2:$C$472=Q2),'03'!$D$2:$D$472)>0))-1","v":16},{"$f":"SUM(--(FREQUENCY('03'!$D$2:$D$472*('03'!$C$2:$C$472=R2),'03'!$D$2:$D$472)>0))-1","v":26},{"$f":"SUM(--(FREQUENCY('03'!$D$2:$D$472*('03'!$C$2:$C$472=S2),'03'!$D$2:$D$472)>0))-1","v":27},{"$f":"SUM(--(FREQUENCY('03'!$D$2:$D$472*('03'!$C$2:$C$472=T2),'03'!$D$2:$D$472)>0))-1","v":22},{"$f":"SUM(--(FREQUENCY('03'!$D$2:$D$472*('03'!$C$2:$C$472=U2),'03'!$D$2:$D$472)>0))-1","v":26},{"$f":"SUM(--(FREQUENCY('03'!$D$2:$D$472*('03'!$C$2:$C$472=V2),'03'!$D$2:$D$472)>0))-1","v":3},{"$f":"SUM(--(FREQUENCY('03'!$D$2:$D$472*('03'!$C$2:$C$472=W2),'03'!$D$2:$D$472)>0))-1","v":0},{"$f":"SUM(--(FREQUENCY('03'!$D$2:$D$472*('03'!$C$2:$C$472=X2),'03'!$D$2:$D$472)>0))-1","v":0},{"$f":"SUM(--(FREQUENCY('03'!$D$2:$D$472*('03'!$C$2:$C$472=Y2),'03'!$D$2:$D$472)>0))-1","v":0},{"$f":"SUM(--(FREQUENCY('03'!$D$2:$D$472*('03'!$C$2:$C$472=Z2),'03'!$D$2:$D$472)>0))-1","v":0},{"$f":"SUM(--(FREQUENCY('03'!$D$2:$D$472*('03'!$C$2:$C$472=AA2),'03'!$D$2:$D$472)>0))-1","v":0},{"$f":"SUM(--(FREQUENCY('03'!$D$2:$D$472*('03'!$C$2:$C$472=AB2),'03'!$D$2:$D$472)>0))-1","v":0},{"$f":"SUM(--(FREQUENCY('03'!$D$2:$D$472*('03'!$C$2:$C$472=AC2),'03'!$D$2:$D$472)>0))-1","v":0},{"$f":"SUM(--(FREQUENCY('03'!$D$2:$D$472*('03'!$C$2:$C$472=AD2),'03'!$D$2:$D$472)>0))-1","v":0},{"$f":"SUM(--(FREQUENCY('03'!$D$2:$D$472*('03'!$C$2:$C$472=AE2),'03'!$D$2:$D$472)>0))-1","v":0},{"$f":"SUM(--(FREQUENCY('03'!$D$2:$D$472*('03'!$C$2:$C$472=AF2),'03'!$D$2:$D$472)>0))-1","v":0}]
["_Boroda_короткая",{"$f":"SUM(IF(FREQUENCY('03'!$D$2:$D$472*('03'!$C$2:$C$472=B2),'03'!$D$2:$D$472)>0,1))-1","v":0},{"$f":"SUM(IF(FREQUENCY('03'!$D$2:$D$472*('03'!$C$2:$C$472=C2),'03'!$D$2:$D$472)>0,1))-1","v":9},{"$f":"SUM(IF(FREQUENCY('03'!$D$2:$D$472*('03'!$C$2:$C$472=D2),'03'!$D$2:$D$472)>0,1))-1","v":21},{"$f":"SUM(IF(FREQUENCY('03'!$D$2:$D$472*('03'!$C$2:$C$472=E2),'03'!$D$2:$D$472)>0,1))-1","v":27},{"$f":"SUM(IF(FREQUENCY('03'!$D$2:$D$472*('03'!$C$2:$C$472=F2),'03'!$D$2:$D$472)>0,1))-1","v":28},{"$f":"SUM(IF(FREQUENCY('03'!$D$2:$D$472*('03'!$C$2:$C$472=G2),'03'!$D$2:$D$472)>0,1))-1","v":17},{"$f":"SUM(IF(FREQUENCY('03'!$D$2:$D$472*('03'!$C$2:$C$472=H2),'03'!$D$2:$D$472)>0,1))-1","v":17},{"$f":"SUM(IF(FREQUENCY('03'!$D$2:$D$472*('03'!$C$2:$C$472=I2),'03'!$D$2:$D$472)>0,1))-1","v":0},{"$f":"SUM(IF(FREQUENCY('03'!$D$2:$D$472*('03'!$C$2:$C$472=J2),'03'!$D$2:$D$472)>0,1))-1","v":11},{"$f":"SUM(IF(FREQUENCY('03'!$D$2:$D$472*('03'!$C$2:$C$472=K2),'03'!$D$2:$D$472)>0,1))-1","v":17},{"$f":"SUM(IF(FREQUENCY('03'!$D$2:$D$472*('03'!$C$2:$C$472=L2),'03'!$D$2:$D$472)>0,1))-1","v":17},{"$f":"SUM(IF(FREQUENCY('03'!$D$2:$D$472*('03'!$C$2:$C$472=M2),'03'!$D$2:$D$472)>0,1))-1","v":18},{"$f":"SUM(IF(FREQUENCY('03'!$D$2:$D$472*('03'!$C$2:$C$472=N2),'03'!$D$2:$D$472)>0,1))-1","v":27},{"$f":"SUM(IF(FREQUENCY('03'!$D$2:$D$472*('03'!$C$2:$C$472=O2),'03'!$D$2:$D$472)>0,1))-1","v":16},{"$f":"SUM(IF(FREQUENCY('03'!$D$2:$D$472*('03'!$C$2:$C$472=P2),'03'!$D$2:$D$472)>0,1))-1","v":0},{"$f":"SUM(IF(FREQUENCY('03'!$D$2:$D$472*('03'!$C$2:$C$472=Q2),'03'!$D$2:$D$472)>0,1))-1","v":16},{"$f":"SUM(IF(FREQUENCY('03'!$D$2:$D$472*('03'!$C$2:$C$472=R2),'03'!$D$2:$D$472)>0,1))-1","v":26},{"$f":"SUM(IF(FREQUENCY('03'!$D$2:$D$472*('03'!$C$2:$C$472=S2),'03'!$D$2:$D$472)>0,1))-1","v":27},{"$f":"SUM(IF(FREQUENCY('03'!$D$2:$D$472*('03'!$C$2:$C$472=T2),'03'!$D$2:$D$472)>0,1))-1","v":22},{"$f":"SUM(IF(FREQUENCY('03'!$D$2:$D$472*('03'!$C$2:$C$472=U2),'03'!$D$2:$D$472)>0,1))-1","v":26},{"$f":"SUM(IF(FREQUENCY('03'!$D$2:$D$472*('03'!$C$2:$C$472=V2),'03'!$D$2:$D$472)>0,1))-1","v":3},{"$f":"SUM(IF(FREQUENCY('03'!$D$2:$D$472*('03'!$C$2:$C$472=W2),'03'!$D$2:$D$472)>0,1))-1","v":0},{"$f":"SUM(IF(FREQUENCY('03'!$D$2:$D$472*('03'!$C$2:$C$472=X2),'03'!$D$2:$D$472)>0,1))-1","v":0},{"$f":"SUM(IF(FREQUENCY('03'!$D$2:$D$472*('03'!$C$2:$C$472=Y2),'03'!$D$2:$D$472)>0,1))-1","v":0},{"$f":"SUM(IF(FREQUENCY('03'!$D$2:$D$472*('03'!$C$2:$C$472=Z2),'03'!$D$2:$D$472)>0,1))-1","v":0},{"$f":"SUM(IF(FREQUENCY('03'!$D$2:$D$472*('03'!$C$2:$C$472=AA2),'03'!$D$2:$D$472)>0,1))-1","v":0},{"$f":"SUM(IF(FREQUENCY('03'!$D$2:$D$472*('03'!$C$2:$C$472=AB2),'03'!$D$2:$D$472)>0,1))-1","v":0},{"$f":"SUM(IF(FREQUENCY('03'!$D$2:$D$472*('03'!$C$2:$C$472=AC2),'03'!$D$2:$D$472)>0,1))-1","v":0},{"$f":"SUM(IF(FREQUENCY('03'!$D$2:$D$472*('03'!$C$2:$C$472=AD2),'03'!$D$2:$D$472)>0,1))-1","v":0},{"$f":"SUM(IF(FREQUENCY('03'!$D$2:$D$472*('03'!$C$2:$C$472=AE2),'03'!$D$2:$D$472)>0,1))-1","v":0},{"$f":"SUM(IF(FREQUENCY('03'!$D$2:$D$472*('03'!$C$2:$C$472=AF2),'03'!$D$2:$D$472)>0,1))-1","v":0}]
["_Boroda_длинная",{"$f":"SUM(IF(FREQUENCY('03'!$D$2:$D$472*('03'!$C$2:$C$472=B2),'03'!$D$2:$D$472*('03'!$C$2:$C$472=B2))>0,1))-1","v":0},{"$f":"SUM(IF(FREQUENCY('03'!$D$2:$D$472*('03'!$C$2:$C$472=C2),'03'!$D$2:$D$472*('03'!$C$2:$C$472=C2))>0,1))-1","v":10},{"$f":"SUM(IF(FREQUENCY('03'!$D$2:$D$472*('03'!$C$2:$C$472=D2),'03'!$D$2:$D$472*('03'!$C$2:$C$472=D2))>0,1))-1","v":22},{"$f":"SUM(IF(FREQUENCY('03'!$D$2:$D$472*('03'!$C$2:$C$472=E2),'03'!$D$2:$D$472*('03'!$C$2:$C$472=E2))>0,1))-1","v":28},{"$f":"SUM(IF(FREQUENCY('03'!$D$2:$D$472*('03'!$C$2:$C$472=F2),'03'!$D$2:$D$472*('03'!$C$2:$C$472=F2))>0,1))-1","v":29},{"$f":"SUM(IF(FREQUENCY('03'!$D$2:$D$472*('03'!$C$2:$C$472=G2),'03'!$D$2:$D$472*('03'!$C$2:$C$472=G2))>0,1))-1","v":18},{"$f":"SUM(IF(FREQUENCY('03'!$D$2:$D$472*('03'!$C$2:$C$472=H2),'03'!$D$2:$D$472*('03'!$C$2:$C$472=H2))>0,1))-1","v":18},{"$f":"SUM(IF(FREQUENCY('03'!$D$2:$D$472*('03'!$C$2:$C$472=I2),'03'!$D$2:$D$472*('03'!$C$2:$C$472=I2))>0,1))-1","v":0},{"$f":"SUM(IF(FREQUENCY('03'!$D$2:$D$472*('03'!$C$2:$C$472=J2),'03'!$D$2:$D$472*('03'!$C$2:$C$472=J2))>0,1))-1","v":12},{"$f":"SUM(IF(FREQUENCY('03'!$D$2:$D$472*('03'!$C$2:$C$472=K2),'03'!$D$2:$D$472*('03'!$C$2:$C$472=K2))>0,1))-1","v":17},{"$f":"SUM(IF(FREQUENCY('03'!$D$2:$D$472*('03'!$C$2:$C$472=L2),'03'!$D$2:$D$472*('03'!$C$2:$C$472=L2))>0,1))-1","v":17},{"$f":"SUM(IF(FREQUENCY('03'!$D$2:$D$472*('03'!$C$2:$C$472=M2),'03'!$D$2:$D$472*('03'!$C$2:$C$472=M2))>0,1))-1","v":19},{"$f":"SUM(IF(FREQUENCY('03'!$D$2:$D$472*('03'!$C$2:$C$472=N2),'03'!$D$2:$D$472*('03'!$C$2:$C$472=N2))>0,1))-1","v":28},{"$f":"SUM(IF(FREQUENCY('03'!$D$2:$D$472*('03'!$C$2:$C$472=O2),'03'!$D$2:$D$472*('03'!$C$2:$C$472=O2))>0,1))-1","v":17},{"$f":"SUM(IF(FREQUENCY('03'!$D$2:$D$472*('03'!$C$2:$C$472=P2),'03'!$D$2:$D$472*('03'!$C$2:$C$472=P2))>0,1))-1","v":0},{"$f":"SUM(IF(FREQUENCY('03'!$D$2:$D$472*('03'!$C$2:$C$472=Q2),'03'!$D$2:$D$472*('03'!$C$2:$C$472=Q2))>0,1))-1","v":16},{"$f":"SUM(IF(FREQUENCY('03'!$D$2:$D$472*('03'!$C$2:$C$472=R2),'03'!$D$2:$D$472*('03'!$C$2:$C$472=R2))>0,1))-1","v":26},{"$f":"SUM(IF(FREQUENCY('03'!$D$2:$D$472*('03'!$C$2:$C$472=S2),'03'!$D$2:$D$472*('03'!$C$2:$C$472=S2))>0,1))-1","v":28},{"$f":"SUM(IF(FREQUENCY('03'!$D$2:$D$472*('03'!$C$2:$C$472=T2),'03'!$D$2:$D$472*('03'!$C$2:$C$472=T2))>0,1))-1","v":23},{"$f":"SUM(IF(FREQUENCY('03'!$D$2:$D$472*('03'!$C$2:$C$472=U2),'03'!$D$2:$D$472*('03'!$C$2:$C$472=U2))>0,1))-1","v":27},{"$f":"SUM(IF(FREQUENCY('03'!$D$2:$D$472*('03'!$C$2:$C$472=V2),'03'!$D$2:$D$472*('03'!$C$2:$C$472=V2))>0,1))-1","v":3},{"$f":"SUM(IF(FREQUENCY('03'!$D$2:$D$472*('03'!$C$2:$C$472=W2),'03'!$D$2:$D$472*('03'!$C$2:$C$472=W2))>0,1))-1","v":0},{"$f":"SUM(IF(FREQUENCY('03'!$D$2:$D$472*('03'!$C$2:$C$472=X2),'03'!$D$2:$D$472*('03'!$C$2:$C$472=X2))>0,1))-1","v":0},{"$f":"SUM(IF(FREQUENCY('03'!$D$2:$D$472*('03'!$C$2:$C$472=Y2),'03'!$D$2:$D$472*('03'!$C$2:$C$472=Y2))>0,1))-1","v":0},{"$f":"SUM(IF(FREQUENCY('03'!$D$2:$D$472*('03'!$C$2:$C$472=Z2),'03'!$D$2:$D$472*('03'!$C$2:$C$472=Z2))>0,1))-1","v":0},{"$f":"SUM(IF(FREQUENCY('03'!$D$2:$D$472*('03'!$C$2:$C$472=AA2),'03'!$D$2:$D$472*('03'!$C$2:$C$472=AA2))>0,1))-1","v":0},{"$f":"SUM(IF(FREQUENCY('03'!$D$2:$D$472*('03'!$C$2:$C$472=AB2),'03'!$D$2:$D$472*('03'!$C$2:$C$472=AB2))>0,1))-1","v":0},{"$f":"SUM(IF(FREQUENCY('03'!$D$2:$D$472*('03'!$C$2:$C$472=AC2),'03'!$D$2:$D$472*('03'!$C$2:$C$472=AC2))>0,1))-1","v":0},{"$f":"SUM(IF(FREQUENCY('03'!$D$2:$D$472*('03'!$C$2:$C$472=AD2),'03'!$D$2:$D$472*('03'!$C$2:$C$472=AD2))>0,1))-1","v":0},{"$f":"SUM(IF(FREQUENCY('03'!$D$2:$D$472*('03'!$C$2:$C$472=AE2),'03'!$D$2:$D$472*('03'!$C$2:$C$472=AE2))>0,1))-1","v":0},{"$f":"SUM(IF(FREQUENCY('03'!$D$2:$D$472*('03'!$C$2:$C$472=AF2),'03'!$D$2:$D$472*('03'!$C$2:$C$472=AF2))>0,1))-1","v":0}]
[]
["  без ОБИД -:)"]
[null,"Уважаемые  _Boroda_ и AlexM, Ваши короткие формулы при отсутствии записей считают лишнюю  1,  это понятно, но когда есть записи --мистика. Т.е. вычитание 1 не поможет и понять не могу. Но главное не в этом,  РАБОЧАЯ формула есть,  ПОПРОБУТЕ   вообще ВСЕ табеля  - одно число     (-1 в ВАШИХ формулах дописал, теперь и при отсутствии данных и при всех табелях \"одно число\" короткие формулы выдают \"0\"    посмотрите выделенные ДАТЫ)  ,В одном случае совпадает, в другом нет ???                                                                                                     ЭТО реальный файл  почищеный от лишнего                                                                        Формаиы и прочее старался проверить"]

{"sheet":"Лист1","index":3,"n_rows":25,"n_cols":8,"rows_kept":25,"cut":false,"hidden":false,"merged":[]}
["   11,00UAH",{"$f":"IFERROR(--(SUBSTITUTE(A1,\"UAH\",\"\")),\" \")","v":11},null,{"$f":"MID(A1,1,LEN(A1)-1)","v":"   11,00UA"},{"$f":"RIGHT(A1,5)","v":"00UAH"}]
["   11,00UAH",11,{"$f":"REPLACE(A2,6,1,\" \")","v":"   11 00UAH"},{"$f":"MID(A2,1,LEN(A2)-1)","v":"   11,00UA"},{"$f":"RIGHT(A2,5)","v":"00UAH"},"ПОДСТАВИТЬ(A2;\"UAH\";\"\"));\" \")",{"$f":"MID(A2,4,256)","v":"11,00UAH"},{"$f":"LEN(A2)","v":11}]
["12 UAH",12,{"$f":"REPLACE(A3,6,1,\" \")","v":"12 UA "},{"$f":"MID(A3,1,LEN(A3)-4)","v":"12"},"2 UAH",null,null,6]
["13 UAH",13,"13 UA ",{"$f":"MID(A4,1,LEN(A4)-4)","v":"13"},"3 UAH",null,null,6]
["14 UAH",14,"14 UA ","14","4 UAH",null,null,6]
["15,01 UAH",15.01,"15,01 UAH","15,01 UA","1 UAH",null,null,9]
["15,01 UAH",15.01,"15,01 UAH","15,01 UA","1 UAH",null,null,9]
["1   UAH",1,"1   U H","1   UA","  UAH",null,null,7]
["15,01 UAH",15.01,"15,01 UAH","15,01 UA","1 UAH",null,null,9]
["15,01 UAH",15.01,"15,01 UAH","15,01 UA","1 UAH",null,null,9]
["15,01 UAH",15.01,"15,01 UAH","15,01 UA","1 UAH",null,null,9]
["15,01 UAH",15.01,"15,01 UAH","15,01 UA","1 UAH",null,null,9]
["15,01 UAH",15.01,"15,01 UAH","15,01 UA","1 UAH",null,null,9]
["15,01 UAH",15.01,"15,01 UAH","15,01 UA","1 UAH",null,null,9]
["15,01 UAH",15.01,"15,01 UAH","15,01 UA","1 UAH",null,null,9]
{"$rows_left_out":10}